program: Gaussian 09
title: 000100917
version: EM64L-G09RevD.01
frameworkgroup: C1[X(C22H17NO5)]
method: RPBEPBE
basis: SDD
operation: Freq
keyword: #p
keyword: freq=noraman
keyword: PBEPBE/SDD
title: #p freq=noraman PBEPBE/SDD
converged: NO YES NO NO
title: Mulliken charges:
elementType: O O O O O N C C C C C C C C C C C C C C C C C C C C C C H H H H H H H H H H H H H H H H H
charge: -0.377656 -0.318203 -0.339317 -0.291597 -0.439538 -0.489433 0.066785 0.107549 0.280733 0.301458 0.299979 -0.140608 -0.090235 0.079558 -0.355556 -0.360000 -0.392925 -0.380462 0.431205 -0.226215 -0.229018 -0.435910 -0.361128 0.361342 -0.324723 -0.377360 -0.277480 -0.337374 0.277549 0.378637 0.264419 0.294652 0.293383 0.238395 0.239342 0.251813 0.272032 0.249743 0.252869 0.389673 0.229934 0.206567 0.207383 0.216100 0.353640
chargesum: 0.00000
title: Mulliken charges with hydrogens summed into heavy atoms:
elementType: O O O O O N C C C C C C C C C C C C C C C C C C C C C C
charge: 0.012016 -0.318203 -0.339317 -0.291597 -0.085898 -0.110795 0.066785 0.107549 0.280733 0.301458 0.299979 -0.140608 -0.090235 0.079558 -0.078007 -0.095581 -0.098273 -0.087079 0.431205 0.012180 0.010324 -0.184096 -0.089096 0.361342 -0.074980 -0.124490 0.159021 0.086109
polarizability: 6.08396568e+02 4.08056179e+01 3.06436675e+02 -2.10430851e+01 1.03334892e+01 1.30744023e+02
1716.lowfreq: -5.0987 -2.4242 -0.0005 0.0006 0.0012 5.6879 17.6409 27.8907 30.5503
frequency: 17.5839 27.8384 30.4341 49.6136 64.4854 80.9393 95.1285 106.4513 124.3434 153.4558 156.2470 164.7122 188.1981 197.2430 227.5421 247.7388 281.3266 308.8233 338.3115 351.0705 377.4172 380.7280 398.3117 414.6194 415.6303 425.0290 427.4871 430.3936 438.6333 457.5662 464.1219 497.4591 501.9287 515.2726 540.6924 567.0405 584.9729 620.3850 635.1927 655.0030 662.2671 699.8867 706.8648 717.5060 725.4707 748.9148 760.7987 802.6486 806.8390 816.2897 826.0181 842.2463 844.1563 861.2152 875.1999 890.0314 892.8513 911.8871 929.3741 939.0532 954.2963 965.7357 985.2995 990.3474 996.6526 998.8224 1014.1058 1016.3636 1023.8415 1049.5959 1068.3379 1086.2983 1088.1502 1121.2349 1164.9216 1165.5552 1175.6438 1178.6826 1189.0208 1217.8285 1223.5409 1244.9025 1250.4674 1261.1909 1282.3509 1285.8075 1306.8371 1332.0685 1333.4876 1352.3570 1357.1841 1369.8494 1383.0794 1389.2502 1391.7412 1405.8206 1429.8253 1440.9478 1454.2424 1457.7777 1458.4595 1468.9752 1495.4707 1502.2353 1511.6615 1561.7273 1575.1955 1595.7650 1608.9406 1610.2499 1617.2428 1628.3631 2450.4921 2966.2973 2976.3288 2986.4646 3038.6800 3083.4950 3136.5268 3142.8749 3149.1138 3152.9102 3160.9117 3165.6040 3168.9862 3172.4019 3173.5930 3181.6216 3556.7191
redmass: 6.5988 4.1749 5.6726 6.8457 4.6487 6.0554 4.9016 4.8709 4.6956 5.6393 6.9729 5.5780 5.3416 6.8893 4.7900 5.6329 3.3131 4.0654 6.2106 5.8936 6.1700 4.5262 9.5012 3.1027 2.3169 5.3440 3.0919 3.2756 3.4982 4.7218 4.3268 5.6726 5.1450 2.8422 5.3710 3.5882 5.4995 5.7921 6.8554 6.3632 5.1844 5.7058 4.1765 3.0745 4.5662 3.8120 6.0316 1.6780 1.8459 2.1563 1.6352 3.0149 1.6768 6.8707 2.9405 3.2818 2.5694 1.4900 1.6949 1.3697 1.3454 5.5332 1.3159 2.5271 1.3877 2.6473 1.3626 1.0633 2.5804 3.1053 2.3093 2.5348 1.7464 1.3177 1.8692 1.3636 1.2320 1.3231 1.1897 1.3766 1.9138 2.1281 2.4724 2.1249 2.1687 3.6791 1.4095 2.0335 1.6262 3.4356 2.5093 1.9717 1.3527 4.8784 3.7252 9.3492 3.7618 4.9834 1.1368 3.1640 1.0894 2.6882 3.0145 3.3559 7.3225 3.9498 7.0802 2.6889 2.6660 4.7314 5.8560 5.5122 1.0775 1.0554 1.0684 1.0842 1.1061 1.0971 1.0864 1.0891 1.0881 1.0906 1.0877 1.0946 1.0954 1.0966 1.0999 1.0973 1.0656
irintensity: 0.2252 0.4945 1.4590 1.7817 1.0162 2.2717 0.1447 3.4223 0.1808 2.2291 1.6020 4.8486 0.8705 0.0838 2.6407 0.3131 3.5923 2.1302 13.7960 8.4017 1.4547 18.5665 4.0852 3.7921 117.0065 1.3376 35.1180 35.2157 53.7881 24.4622 3.6612 9.7258 8.0670 16.5083 24.4172 22.3831 18.6958 3.3006 1.9782 7.7491 3.1127 18.4772 3.8541 19.1589 1.9045 13.8253 3.2496 53.6749 3.5608 2.7614 80.3961 2.5916 17.3533 8.2493 22.3011 39.0678 52.5292 76.6368 3.0997 4.7688 2.6300 11.6013 1.8980 165.0371 2.5016 16.9961 0.5304 128.8059 21.4613 50.5886 2.0096 8.3306 13.7901 12.7260 15.8960 3.4780 42.1181 222.5545 12.7324 155.3160 263.6414 73.6652 9.7810 75.7216 130.9848 147.6672 61.6600 352.9854 134.1220 56.9409 8.8778 15.6183 40.1355 12.2694 101.7478 59.1377 0.5943 37.2459 82.4355 4.9724 9.7222 24.2570 102.0020 629.0424 92.6243 28.3833 0.4407 69.7645 121.0324 25.1000 14.8838 99.8736 63.0558 43.9187 54.4031 31.5679 46.8450 33.3844 3.8912 10.4809 14.0816 13.1247 0.8148 1.4550 11.9186 7.2448 34.0171 4.8076 6.7549
temp: 298.150 k
press: 1.00000 atm
elementType: 8 8 8 8 8 7 6 6 6 6 6 6 6 6 6 6 6 6 6 6 6 6 6 6 6 6 6 6 1 1 1 1 1 1 1 1 1 1 1 1 1 1 1 1 1
symmnumber: 1
zpe: 890737.4 jmol-1
zpe.correction: 0.339264 hartree
zpe.thermalcorrener: 0.362160 hartree
zpe.thermalcorrenthalpy: 0.363105 hartree
zpe.thermalcorrgfe: 0.285392 hartree
zpe.sumelectzpe: -1277.495326 hartree
zpe.sumelectthermal: -1277.472429 hartree
zpe.sumelectthermalent: -1277.471485 hartree
zpe.sumelectthermalfe: -1277.549198 hartree
dipole: 1.8069 -1.5711 -1.7600
dipole: 2.9717
quadrupole: -164.4478 -161.0322 -162.1277
quadrupole: 21.8715 -18.1865 5.3325
quadrupole: -1.9119 1.5037 0.4082 21.8715 -18.1865 5.3325
hfenergy: -1277.8345899 hartree
pointgroup: C01 [X(C22H17N1O5)]
dipole: 0.7187884 0.5626006 0.7305687 debye
polarizability: 609.6633571|-39.0217095|302.5250085|8.5465622|26.2520214|133.3889009 unknown
InChI: InChI=1S/C22H17NO5/c24-11-12-28-14-7-5-13(6-8-14)23-17-9-10-18(25)20-19(17)21(26)15-3-1-2-4-16(15)22(20)27/h1-10,23-25H,11-12H2
charge 0 multiplicity 1
45 atoms
O  -3.292742 -3.657278 -0.234213
O  -1.183986 2.068909 0.362712
O  -5.028783 -1.880852 -0.242143
O  6.300429 -0.07488 -0.31776
O  8.795737 0.859831 -1.405452
N  0.678917 0.288526 0.257686
C  -1.685433 -0.283447 0.095881
C  -2.70615 -1.29283 -0.036881
C  -0.299479 -0.681736 0.137153
C  -3.506722 1.479759 0.103451
C  -4.510557 0.473831 -0.044116
C  -2.066289 1.125291 0.191631
C  -4.122828 -0.944919 -0.111668
C  -2.351319 -2.676139 -0.102604
C  0.016298 -2.089674 0.110851
C  -0.975863 -3.055438 -0.004005
C  -3.893621 2.842456 0.172253
C  -5.878802 0.842255 -0.120644
C  2.086974 0.151264 0.130637
C  -5.252832 3.199802 0.092641
C  -6.249074 2.197674 -0.053746
C  2.914957 0.974699 0.936119
C  2.701353 -0.707818 -0.82544
C  4.916501 0.057256 -0.120924
C  4.31913 0.937052 0.815602
C  4.099853 -0.759529 -0.942122
C  7.20491 0.772185 0.487543
C  8.6123 0.451396 -0.012256
H  1.057202 -2.402297 0.225985
H  0.260944 1.245616 0.397194
H  -0.734227 -4.122172 -0.004954
H  -3.107641 3.594751 0.2876
H  -6.622847 0.047641 -0.231386
H  -5.54424 4.254376 0.143819
H  -7.305075 2.48137 -0.113921
H  2.451015 1.643038 1.669687
H  2.084568 -1.300567 -1.507617
H  4.926904 1.58324 1.45482
H  4.578142 -1.412607 -1.678327
H  -4.226655 -3.159664 -0.269599
H  6.967156 1.840443 0.314208
H  7.092866 0.531192 1.564667
H  8.813819 -0.631953 0.120348
H  9.354492 1.026711 0.566235
H  8.086096 0.421636 -1.942142
