program: Gaussian 09
title: 000100846
version: EM64L-G09RevD.01
frameworkgroup: C1[X(C13H19N)]
method: RPBEPBE
basis: SDD
operation: Freq
keyword: #pfreq=noraman
keyword: PBEPBE/SDD
title: #p freq=noraman PBEPBE/SDD
converged: YES YES NO NO
title: Mulliken charges:
elementType: N C C C C C C C C C C C C C H H H H H H H H H H H H H H H H H H H
charge: -0.274701 0.240282 -0.480878 -0.429555 -0.394807 -0.450841 -0.439224 0.457865 -0.729307 -0.404561 -0.406148 -0.258448 -0.259336 -0.247663 0.218899 0.194838 0.185621 0.210233 0.197376 0.200755 0.205011 0.205346 0.203942 0.199054 0.259555 0.217410 0.238551 0.212604 0.233415 0.223513 0.222499 0.221886 0.226812
chargesum: 0.00000
title: Mulliken charges with hydrogens summed into heavy atoms:
elementType: N C C C C C C C C C C C C C
charge: -0.015146 0.240282 -0.067141 -0.033701 0.003324 -0.040484 -0.036227 0.457865 -0.060742 -0.171146 -0.182635 -0.035949 -0.037450 -0.020852
polarizability: 1.60143194e+02 -1.24130762e+01 1.18101930e+02 1.30045264e-01 -1.13321122e+00 1.36660079e+02
1716.lowfreq: -6.7178 0.0004 0.0006 0.0008 3.7598 13.2237 41.2320 75.2065 94.9657
frequency: 40.8294 75.1723 94.9240 153.5219 164.4145 204.2415 234.2087 272.2489 284.8942 315.1259 334.5340 368.5817 403.5866 426.7183 454.7721 479.6135 499.6656 524.7342 581.8395 617.9335 683.6350 696.6678 704.9340 761.8205 775.7874 810.7956 846.3727 850.3869 878.2189 908.4871 915.0902 939.7868 973.9009 990.3903 991.8975 1011.9245 1017.5713 1030.3308 1047.3362 1055.2505 1065.2289 1086.8447 1098.1639 1114.9160 1133.5216 1168.2338 1172.6459 1181.8090 1183.7236 1199.5172 1217.6102 1254.8524 1277.5485 1311.4935 1319.9584 1323.3496 1326.3222 1331.0851 1349.9855 1373.0101 1389.4001 1392.2737 1432.0963 1443.6981 1454.6274 1465.2235 1470.7768 1474.3161 1479.0263 1482.7844 1486.9650 1489.1614 1586.2042 1609.8215 2868.3419 2879.6284 2962.3901 2980.4618 2989.8127 2992.9388 3015.5900 3022.6539 3028.7311 3048.5388 3052.9660 3071.1680 3080.2489 3116.4556 3123.4209 3137.7290 3148.7748 3162.1256 3443.5850
redmass: 3.5211 3.4511 2.7232 2.5867 2.6360 2.5650 1.6634 1.9492 2.7819 2.2387 2.8083 2.2408 2.8225 2.6964 2.9451 3.3295 2.8387 1.7227 2.3110 6.3573 4.7019 1.7826 1.6244 1.5185 1.6601 1.5057 2.1080 1.2785 2.4867 1.6909 1.9412 2.0460 1.3885 6.0090 1.3115 1.8867 1.7738 2.3115 1.5895 2.1846 1.8265 1.8032 2.6097 2.4402 2.5661 2.6497 1.0890 1.6648 1.1643 1.1245 1.4112 1.2777 1.2689 1.3826 1.4275 1.3391 1.4037 1.4753 1.3760 6.4448 1.3272 1.2838 2.2319 1.3116 1.1004 1.1069 1.0755 1.1360 1.0826 1.1828 1.5921 1.0631 5.8418 6.0391 1.0711 1.0696 1.0592 1.0363 1.0609 1.0620 1.1008 1.0877 1.0889 1.1004 1.1001 1.0989 1.1003 1.0843 1.0871 1.0928 1.0942 1.1006 1.0750
irintensity: 0.0837 0.0295 0.1483 1.0495 0.7140 0.3528 0.9849 0.5219 1.1578 0.2601 1.1820 5.7629 0.2966 0.9838 3.8770 1.8928 19.5166 68.2491 14.1598 0.0730 4.8626 61.3363 62.4695 28.9973 20.0233 0.8566 0.5941 0.1049 3.2942 0.2862 1.9811 3.7801 0.0625 0.1448 0.3634 15.8435 5.6530 7.0912 7.0321 4.7074 5.5527 3.2808 4.7454 0.4449 9.8458 7.9729 0.2842 2.1605 5.3006 0.7982 2.7540 0.9508 1.0454 0.1366 7.9824 14.2377 7.7193 4.3727 4.9928 1.3392 5.5661 12.9517 5.5962 6.3182 3.7000 13.2171 1.6508 25.0777 10.0789 2.9499 9.5215 11.4984 1.7764 9.0265 62.7799 107.2760 33.0500 25.6768 14.7844 45.3985 17.0091 81.5149 62.5623 23.1745 64.1148 44.6301 50.1824 4.9570 0.8755 30.8156 43.2635 16.6741 2.7205
temp: 298.150 k
press: 1.00000 atm
elementType: 7 6 6 6 6 6 6 6 6 6 6 6 6 6 1 1 1 1 1 1 1 1 1 1 1 1 1 1 1 1 1 1 1
symmnumber: 1
zpe: 763779.1 jmol-1
zpe.correction: 0.290908 hartree
zpe.thermalcorrener: 0.303918 hartree
zpe.thermalcorrenthalpy: 0.304862 hartree
zpe.thermalcorrgfe: 0.251922 hartree
zpe.sumelectzpe: -560.450968 hartree
zpe.sumelectthermal: -560.437958 hartree
zpe.sumelectthermalent: -560.437014 hartree
zpe.sumelectthermalfe: -560.489953 hartree
dipole: 0.3176 -0.4956 0.1213
dipole: 0.6010
quadrupole: -87.1536 -85.2381 -79.9669
quadrupole: -0.3458 -1.1184 -0.8937
quadrupole: -3.0341 -1.1186 4.1526 -0.3458 -1.1184 -0.8937
hfenergy: -560.7418757 hartree
pointgroup: C01 [X(C13H19N1)]
dipole: -0.1238337 0.2007913 0.016309 debye
polarizability: 160.1249899|-12.3140155|119.1325813|1.4691513|4.4836167|135.6476312 unknown
InChI: InChI=1S/C13H19N/c1-2-13(8-10-14-11-9-13)12-6-4-3-5-7-12/h3-7,14H,2,8-11H2,1H3
charge 0 multiplicity 1
33 atoms
N  2.85024 1.466557 -0.10434
C  0.798119 -0.696733 -0.136025
C  1.707342 -0.373919 1.090718
C  1.573961 -0.194997 -1.400827
C  0.625916 -2.252845 -0.271426
C  2.152533 1.104441 1.15173
C  1.990495 1.285489 -1.297967
C  -0.611303 -0.057699 -0.044463
C  -0.066629 -2.957921 0.91405
C  -1.157088 0.433015 1.171521
C  -1.452141 -0.022233 -1.191846
C  -2.47269 0.946808 1.238963
C  -2.766321 0.489822 -1.133474
C  -3.286492 0.982217 0.08553
H  2.61914 -0.996389 1.001345
H  1.220976 -0.654854 2.04294
H  0.978526 -0.351741 -2.319361
H  2.493231 -0.804578 -1.499961
H  1.633606 -2.692222 -0.422309
H  0.051712 -2.456928 -1.197912
H  1.263893 1.753678 1.346073
H  2.853912 1.241709 1.996363
H  2.56909 1.572528 -2.195835
H  1.071016 1.92217 -1.270412
H  3.261968 2.408029 -0.06049
H  0.519396 -2.861992 1.846301
H  -1.072174 -2.539258 1.098496
H  -0.181742 -4.037655 0.705956
H  -0.558414 0.414412 2.087437
H  -1.082934 -0.4028 -2.150999
H  -2.860199 1.317928 2.195057
H  -3.384668 0.50234 -2.038731
H  -4.305878 1.381221 0.134599
