program: Gaussian 09
title: 000100861
version: EM64L-G09RevD.01
frameworkgroup: C1[X(C12H13ClN2O)]
method: RPBEPBE
basis: SDD
operation: Freq
keyword: #p
keyword: freq=noraman
keyword: PBEPBE/SDD
title: #p freq=noraman PBEPBE/SDD
converged: YES YES NO NO
title: Mulliken charges:
elementType: Cl O N N C C C C C C C C C C C C H H H H H H H H H H H H H
charge: -0.082040 -0.275073 -0.245436 -0.057297 0.094322 0.124437 0.183343 -0.464656 0.082478 -0.472350 -0.126238 0.447199 -0.330983 -0.610516 -0.798559 -0.791224 0.237286 0.258405 0.275702 0.295671 0.239251 0.306208 0.260876 0.241292 0.232613 0.259153 0.239387 0.240272 0.236475
chargesum: 0.00000
title: Mulliken charges with hydrogens summed into heavy atoms:
elementType: Cl O N N C C C C C C C C C C C C
charge: -0.082040 -0.275073 -0.245436 -0.057297 0.094322 0.124437 0.183343 0.031035 0.082478 -0.196648 0.169433 0.447199 -0.091732 -0.043431 -0.065500 -0.075090
polarizability: 2.68802582e+02 1.17653543e+01 1.59627629e+02 -1.30688053e+01 3.61883221e+00 8.17223474e+01
1716.lowfreq: -14.3038 -3.8200 -0.0021 0.0006 0.0007 5.2927 33.8379 38.4183 76.6159
frequency: 33.4726 38.3530 76.5474 91.3766 96.8103 117.9143 120.8958 143.6176 207.4321 211.0395 256.1566 285.8153 298.4859 330.3404 346.2508 380.4455 441.3627 451.4119 462.9178 535.2170 571.0958 580.0620 627.4863 633.9826 674.0400 677.0728 717.2562 764.2525 768.1026 779.3429 828.0747 879.2376 904.5212 926.1612 975.6500 980.1173 992.8866 1018.6026 1034.2833 1045.2601 1049.3817 1062.1178 1082.5969 1144.9172 1158.5842 1175.9072 1240.2519 1248.0939 1254.7002 1283.0305 1292.6228 1317.3917 1325.7797 1385.2777 1398.6372 1405.7328 1445.9169 1448.6706 1452.8208 1465.4414 1466.1264 1468.1683 1471.8105 1484.4499 1506.0430 1548.7904 1624.5751 1649.8392 2981.5708 2986.5423 3021.3107 3058.7651 3059.1237 3065.1241 3087.1653 3100.5749 3121.9566 3149.6256 3161.1187 3178.2523 3187.3766
redmass: 5.2828 6.4075 2.4502 1.4734 2.2982 1.3930 1.8844 4.7532 6.6132 3.7301 3.9613 5.4893 2.5341 3.3413 5.3658 4.7997 3.9597 4.8090 4.3987 7.5988 3.8072 4.8944 5.3498 4.3731 5.5318 6.0469 4.9226 4.0012 1.5074 3.8301 1.3621 3.8887 1.3881 2.5751 2.0715 1.3057 1.5448 1.6442 2.4046 2.3088 1.5727 4.3217 1.8120 1.7234 1.6502 2.4608 2.2236 2.2389 1.4105 1.2578 1.8826 2.5136 1.5631 1.4043 1.3433 2.1168 1.4870 1.8558 1.2426 1.0486 1.1519 1.3504 1.0888 3.1741 4.1908 5.9641 9.7373 6.6015 1.0380 1.0390 1.0606 1.0969 1.0566 1.0963 1.1018 1.0988 1.0983 1.1116 1.0891 1.0929 1.0981
irintensity: 0.0059 0.4655 1.8935 3.0777 0.1055 3.3990 0.0691 2.9878 4.8951 1.4745 0.3494 4.1018 0.8507 3.1568 2.2880 8.2306 8.0032 1.3947 5.5083 7.5439 5.5476 1.9890 45.5487 0.2863 18.9471 8.2531 17.1573 2.0203 4.5573 15.4806 39.4494 9.7547 8.7621 1.1824 6.8361 1.9970 0.8502 5.2313 10.9231 6.0237 15.2489 6.6294 0.9066 2.9259 37.1653 3.4929 2.6364 58.3986 6.4530 4.0312 0.5819 12.7390 32.7938 10.6639 82.5025 63.8336 58.9081 10.2028 23.2570 13.9331 30.3090 6.2246 15.2706 323.0291 47.8972 1.1141 342.8075 90.3824 24.2445 11.5353 11.4885 12.2721 20.5364 14.2666 6.0144 15.2614 10.5887 6.8460 6.0496 0.6220 9.9032
temp: 298.150 k
press: 1.00000 atm
elementType: 17 8 7 7 6 6 6 6 6 6 6 6 6 6 6 6 1 1 1 1 1 1 1 1 1 1 1 1 1
symmnumber: 1
zpe: 594062.7 jmol-1
zpe.correction: 0.226267 hartree
zpe.thermalcorrener: 0.241656 hartree
zpe.thermalcorrenthalpy: 0.242601 hartree
zpe.thermalcorrgfe: 0.182258 hartree
zpe.sumelectzpe: -1108.729024 hartree
zpe.sumelectthermal: -1108.713634 hartree
zpe.sumelectthermalent: -1108.712690 hartree
zpe.sumelectthermalfe: -1108.773033 hartree
dipole: -6.4899 1.2954 0.5746
dipole: 6.6428
quadrupole: -95.7735 -103.5043 -101.8810
quadrupole: 12.5777 -2.0440 -1.6706
quadrupole: 4.6128 -3.1181 -1.4947 12.5777 -2.0440 -1.6706
hfenergy: -1108.9552909 hartree
pointgroup: C01 [X(C12H13Cl1N2O1)]
dipole: 2.5314973 0.6270714 -0.1691538 debye
polarizability: 269.8965023|-6.5081003|159.0390156|-10.9240877|-0.9634042|81.2170409 unknown
InChI: InChI=1S/C12H13ClN2O/c1-8-4-6-15-11(7-8)14-9(2)10(3-5-13)12(15)16/h4,6-7H,3,5H2,1-2H3
charge 0 multiplicity 1
29 atoms
Cl -5.479281 -0.891356 -0.538493
O  -0.978762 -2.134415 0.368947
N  0.779009 -0.573558 0.111392
N  0.333677 1.809142 0.025213
C  -1.526114 0.234626 0.335677
C  1.202774 0.773714 -0.011341
C  -0.647882 -0.910123 0.282469
C  -3.000891 -0.069032 0.532819
C  -1.009347 1.543067 0.196993
C  2.608835 1.005735 -0.180723
C  1.692449 -1.624016 0.067586
C  3.536157 -0.034064 -0.223695
C  3.04211 -1.384362 -0.093417
C  -3.627113 -0.563393 -0.782718
C  -1.902058 2.76588 0.237542
C  5.017596 0.215457 -0.399806
H  -3.545966 0.819683 0.890435
H  -3.112373 -0.867663 1.287936
H  2.906275 2.053296 -0.273191
H  1.2372 -2.61224 0.170602
H  3.732395 -2.232482 -0.12193
H  -3.197494 -1.523861 -1.099709
H  -3.571722 0.183803 -1.588748
H  -2.340755 2.907317 1.243475
H  -2.7420 2.687876 -0.476084
H  -1.301756 3.654483 -0.00836
H  5.401603 -0.303846 -1.297897
H  5.588385 -0.172194 0.465073
H  5.24125 1.289628 -0.503249
