program: Gaussian 09
title: 000100887
version: EM64L-G09RevD.01
frameworkgroup: C1[X(C22H27NO)]
method: RPBEPBE
basis: SDD
operation: Freq
keyword: #p
keyword: freq=noraman
keyword: PBEPBE/SDD
title: #p freq=noraman PBEPBE/SDD
converged: YES YES NO NO
title: Mulliken charges:
elementType: O N C C C C C C C C C C C C C C C C C C C C C C H H H H H H H H H H H H H H H H H H H H H H H H H H H
charge: -0.258255 -0.025588 -0.381211 -0.378926 -0.371880 -0.375345 -0.353593 -0.406856 -0.356262 -0.319104 -0.695972 0.352719 0.354640 -0.362411 -0.393808 -0.390603 -0.366733 0.356012 -0.378741 -0.381548 -0.384338 -0.382426 0.392766 -0.262511 0.192931 0.191903 0.195810 0.196939 0.190899 0.190165 0.191825 0.193217 0.187795 0.188283 0.216728 0.217414 0.195276 0.195098 0.209107 0.209636 0.216096 0.209786 0.209755 0.250784 0.253230 0.234597 0.238245 0.242622 0.243365 0.254073 0.254396
chargesum: 0.00000
title: Mulliken charges with hydrogens summed into heavy atoms:
elementType: O N C C C C C C C C C C C C C C C C C C C C C C
charge: -0.258255 -0.025588 0.003624 0.013823 0.009184 0.009696 0.022485 0.027286 0.034112 0.099639 -0.060335 0.352719 0.354640 -0.111628 -0.140577 -0.156006 -0.128488 0.356012 -0.136119 -0.138183 -0.130265 -0.128029 0.392766 -0.262511
polarizability: 4.84206231e+02 -2.50700341e+01 2.14026260e+02 9.77843651e+00 7.88512725e+00 1.43572808e+02
1716.lowfreq: -17.9974 -1.6320 -0.0018 -0.0010 0.0014 2.6842 7.0031 10.0260 18.2564
frequency: -9.7296 9.9155 18.2331 28.2324 47.1723 56.5321 62.3135 73.6019 78.5173 91.4352 112.4818 121.3100 122.9768 135.1473 145.3901 150.3935 156.8180 181.1110 224.2926 231.6732 239.9045 259.0198 320.3518 347.4531 354.9645 404.0574 408.3515 414.8965 446.6748 459.3670 472.7135 500.9939 528.9039 531.5577 550.2082 571.5120 629.4429 644.9507 650.5632 720.7168 724.2694 726.1052 743.6980 748.0146 769.3743 777.4488 806.4662 813.7071 829.9132 832.1391 847.2702 859.8844 887.2321 890.1788 942.3963 958.3041 960.1672 963.4822 970.7006 978.3818 988.8886 992.5792 1008.0292 1010.4826 1019.7105 1024.1465 1041.7177 1065.6235 1076.9403 1080.9254 1093.1030 1123.2829 1123.8683 1126.2940 1148.4542 1183.7486 1185.8218 1191.6133 1213.0654 1215.1952 1218.1045 1237.6806 1251.9754 1255.1944 1278.0929 1282.9420 1287.1299 1290.7318 1295.3571 1296.8070 1297.8142 1304.9607 1308.3495 1324.2956 1336.1217 1347.7493 1354.7681 1358.7425 1368.0075 1383.4898 1386.7041 1420.4084 1427.7137 1460.6562 1460.9922 1465.1497 1467.3913 1471.0156 1476.0129 1477.1199 1480.9978 1485.0017 1487.8110 1490.6716 1520.8148 1547.5838 1575.0201 1612.3497 1624.5456 2172.6596 2947.5313 2950.0734 2950.5963 2953.8427 2956.5216 2963.7438 2968.2025 2971.3026 2983.9894 2990.1513 2994.3847 2998.3946 3006.2946 3012.1817 3027.4640 3040.1625 3063.0788 3067.9529 3070.6422 3133.2170 3136.7141 3141.2972 3143.1750 3162.9220 3165.9721 3167.4373 3169.7797
redmass: 2.1786 2.9651 4.5375 4.3660 5.7030 4.1949 2.7780 2.5007 2.7461 4.4916 2.5476 2.6277 3.6619 3.5258 2.1343 4.2194 2.5325 4.7692 6.4017 1.1074 4.5327 4.7887 5.2495 4.4572 3.8333 2.8870 4.6722 2.9749 3.7819 3.9159 4.3374 3.8827 4.8777 3.2266 6.0954 2.6852 6.8972 7.2407 6.5114 1.0608 3.6440 1.0777 1.1070 3.5317 6.5019 1.1434 5.0066 1.3844 1.2009 1.4960 1.2568 1.7462 1.8081 1.2493 1.3662 1.2122 4.1429 1.5439 1.3836 1.3884 5.3641 4.5119 3.0904 3.9466 1.1022 2.3999 3.3998 2.8364 2.5642 2.0932 2.3028 1.5938 1.4133 2.3192 1.4129 1.2994 1.7219 1.5666 2.0511 1.3008 1.4235 2.4343 1.3058 1.3024 1.1352 1.0891 1.0701 1.3006 2.8014 1.1102 1.1181 1.4154 1.3371 1.3690 2.7930 1.4876 1.6720 1.6171 5.0490 1.5976 1.2170 3.6635 4.0963 1.0732 1.0715 1.0712 1.0801 1.1077 1.1347 1.0481 1.2235 1.3607 1.1395 1.2201 2.8819 6.3288 7.3256 6.0446 6.3900 12.6297 1.0552 1.0586 1.0588 1.0588 1.0592 1.0589 1.0587 1.0363 1.0966 1.0984 1.0592 1.1011 1.1059 1.1040 1.1050 1.1049 1.1051 1.1007 1.0993 1.0888 1.0886 1.0876 1.0878 1.0964 1.0943 1.0975 1.0962
irintensity: 0.1818 0.2833 0.2972 0.0739 1.0274 0.5962 0.6773 0.6878 0.6592 1.2518 0.7146 0.8663 0.7613 0.0443 0.3999 2.4928 1.3208 0.4969 3.7383 0.0043 0.3458 0.4891 0.6263 0.6476 1.1451 0.0113 0.7826 2.1665 0.9842 1.5272 3.0015 1.2243 19.0470 18.8968 0.9977 10.4991 0.8844 0.2977 16.7001 15.2524 2.1270 0.2093 6.3385 0.6809 5.6986 0.9098 4.5847 28.8337 5.5256 101.2329 0.1690 23.0224 4.5211 0.9426 0.6221 1.5261 86.3539 26.1811 1.4514 0.2437 6.0206 2.7860 0.1636 12.0329 0.2924 8.9160 4.4548 2.7379 7.0091 0.0134 17.3751 19.4670 4.7358 6.0285 0.8257 208.8413 0.9585 31.2054 49.3349 10.9715 1.0326 275.7776 0.1958 5.9765 0.0003 0.0168 0.9744 0.8990 53.0666 0.3973 0.0363 8.2271 0.1698 0.4575 3.6155 1.2342 0.4615 0.3636 3.7894 38.9559 10.9959 5.0764 6.8384 0.1497 0.0172 0.0468 5.3415 30.1994 31.3705 13.5865 77.3144 58.7489 38.5292 13.8150 18.6035 2.1257 18.2508 278.5902 40.5622 101.9820 23.9868 0.4157 0.3156 10.2751 0.8066 34.5432 173.3952 39.8954 0.1755 0.6611 37.9700 1.4498 22.7424 0.2838 0.5572 128.9030 91.8042 104.4022 55.7728 10.8033 20.3077 3.3256 4.0236 12.3281 19.5137 1.7505 5.6618
temp: 298.150 k
press: 1.00000 atm
elementType: 8 7 6 6 6 6 6 6 6 6 6 6 6 6 6 6 6 6 6 6 6 6 6 6 1 1 1 1 1 1 1 1 1 1 1 1 1 1 1 1 1 1 1 1 1 1 1 1 1 1 1
symmnumber: 1
zpe: 1131504.2 jmol-1
zpe.correction: 0.430967 hartree
zpe.thermalcorrener: 0.455095 hartree
zpe.thermalcorrenthalpy: 0.456039 hartree
zpe.thermalcorrgfe: 0.373219 hartree
zpe.sumelectzpe: -982.734130 hartree
zpe.sumelectthermal: -982.710002 hartree
zpe.sumelectthermalent: -982.709058 hartree
zpe.sumelectthermalfe: -982.791878 hartree
dipole: -7.6067 -0.1227 -0.0952
dipole: 7.6083
quadrupole: -224.8629 -137.8565 -147.3394
quadrupole: 12.6393 -1.5721 3.5238
quadrupole: -54.8433 32.1631 22.6802 12.6393 -1.5721 3.5238
hfenergy: -983.1650973 hartree
pointgroup: C01 [X(C22H27N1O1)]
dipole: -2.991971 0.0887425 0.0159724 debye
polarizability: 484.9368077|16.6529106|173.9470433|14.751961|35.897408|182.9214486 unknown
InChI: InChI=1S/C22H27NO/c1-2-3-4-5-6-7-8-17-24-22-15-13-21(14-16-22)20-11-9-19(18-23)10-12-20/h9-16H,2-8,17H2,1H3
charge 0 multiplicity 1
51 atoms
O  -0.912133 -1.030239 -0.632831
N  10.120434 0.661133 0.679799
C  -7.007206 0.553969 0.189112
C  -5.842157 -0.316765 -0.332228
C  -8.396636 0.034013 -0.243952
C  -4.451304 0.204469 0.094591
C  -9.564677 0.910138 0.262107
C  -3.296918 -0.666338 -0.452863
C  -10.953124 0.389152 -0.174512
C  -1.925201 -0.134958 -0.034627
C  -12.114993 1.273305 0.327895
C  0.437068 -0.744362 -0.404396
C  3.24826 -0.343592 -0.0763
C  0.914589 0.343822 0.37024
C  1.362457 -1.632159 -1.011544
C  2.303719 0.529257 0.526214
C  2.7413 -1.429572 -0.849319
C  4.710551 -0.132323 0.08747
C  5.244244 0.46059 1.26835
C  5.628148 -0.514196 -0.933841
C  6.625344 0.667866 1.425182
C  7.011915 -0.316529 -0.787918
C  7.528466 0.279955 0.39614
C  8.943192 0.48781 0.550971
H  -6.963268 0.602973 1.297367
H  -6.877241 1.595302 -0.173467
H  -5.889193 -0.365801 -1.440048
H  -5.970697 -1.357637 0.030819
H  -8.531268 -1.004288 0.125441
H  -8.436417 -0.023525 -1.352045
H  -4.330256 1.249532 -0.260196
H  -4.399966 0.241913 1.202902
H  -9.432006 1.948685 -0.107573
H  -9.52854 0.968391 1.370299
H  -3.343362 -0.702312 -1.558185
H  -3.403599 -1.707384 -0.092497
H  -11.087171 -0.646836 0.198783
H  -10.986218 0.326609 -1.281528
H  -1.767819 0.899142 -0.406625
H  -1.814278 -0.137701 1.069856
H  -13.095341 0.878055 0.003774
H  -12.022655 2.306152 -0.058116
H  -12.121638 1.328652 1.433013
H  0.223678 1.049346 0.840203
H  0.975676 -2.473427 -1.594371
H  2.654502 1.394404 1.100136
H  3.436158 -2.145265 -1.302267
H  4.570591 0.734118 2.087192
H  5.249379 -0.943208 -1.867328
H  7.015953 1.11781 2.34341
H  7.699255 -0.609347 -1.587891
