program: Gaussian 09
title: 000100983
version: EM64L-G09RevD.01
frameworkgroup: C1[X(C13H26O7Si)]
method: RPBEPBE
basis: SDD
operation: Freq
keyword: #p
keyword: freq=noraman
keyword: PBEPBE/SDD
title: #p freq=noraman PBEPBE/SDD
converged: YES YES NO NO
title: Mulliken charges:
elementType: Si O O O O O O O C C C C C C C C C C C C C H H H H H H H H H H H H H H H H H H H H H H H H H H
charge: 1.571061 -0.281546 -0.612623 -0.606187 -0.608530 -0.439285 -0.272791 -0.282893 -0.911485 -0.363574 -0.243669 -0.291320 -0.085497 -0.308372 -0.480386 -0.503995 -0.479361 0.211586 0.349229 -0.763326 -0.648785 0.238635 0.313326 0.209177 0.245021 0.210774 0.175809 0.170886 0.213120 0.252606 0.230158 0.238432 0.226055 0.211961 0.223401 0.260755 0.211839 0.218817 0.222528 0.240712 0.203235 0.329702 0.234071 0.244296 0.212919 0.214252 0.299260
chargesum: 0.00000
title: Mulliken charges with hydrogens summed into heavy atoms:
elementType: Si O O O O O O O C C C C C C C C C C C C C
charge: 1.571061 -0.281546 -0.612623 -0.606187 -0.608530 -0.109583 -0.272791 -0.282893 -0.359525 0.090625 0.142914 0.092686 0.167109 0.160218 0.181031 0.187417 0.187115 0.211586 0.349229 -0.072040 -0.135273
polarizability: 2.26014038e+02 -1.11820843e+01 1.79054491e+02 7.57580173e+00 -1.03920854e+01 1.57889370e+02
1716.lowfreq: -50.2562 -7.4568 -3.6750 -0.0003 0.0006 0.0016 8.8267 23.1074 23.8754
frequency: -48.9942 22.6150 23.4861 38.3526 45.4130 51.4699 52.7609 58.7279 63.4159 65.3101 72.5586 79.7013 81.5780 91.0130 98.7465 105.8983 115.1165 126.8664 147.1799 153.5131 165.4160 190.3622 194.8098 221.3838 232.2324 246.3843 265.3769 280.9201 310.5448 330.1016 340.8820 348.4971 352.3165 366.7061 381.9878 407.8485 435.6377 443.7030 496.7789 547.2871 574.8424 581.1694 642.4303 676.0717 706.7145 749.1655 773.6923 779.9843 785.6210 842.8553 888.7952 906.9931 910.7464 926.5679 968.2513 977.0533 981.9779 1009.6736 1012.9085 1026.2370 1038.2744 1042.7323 1052.5660 1061.9626 1070.4552 1076.4808 1101.3139 1114.4783 1119.5938 1122.8872 1124.2831 1138.3993 1144.4875 1146.0582 1156.8843 1167.7130 1187.5746 1210.3210 1215.6443 1252.4101 1258.7498 1286.8638 1300.2350 1324.9756 1345.6250 1351.6823 1355.9319 1364.4531 1397.0476 1400.3489 1429.8035 1434.7225 1438.1765 1440.8297 1450.9416 1456.4892 1458.0839 1462.6437 1468.6542 1469.9325 1471.0528 1475.8428 1477.9935 1478.6721 1479.2990 1481.5629 1484.8449 1610.2264 1651.7080 2878.2676 2925.3424 2949.5871 2958.3317 2962.9715 2976.8180 2981.3174 2987.2720 2988.2902 3002.5789 3015.1175 3037.4338 3049.5564 3051.1593 3055.5639 3070.6528 3072.2834 3080.3052 3081.4296 3084.0286 3085.9232 3087.2862 3093.9361 3095.7483 3196.1692 3537.2255
redmass: 1.1384 4.2886 2.7025 3.5986 2.5742 3.5508 3.1020 1.4875 3.2776 2.2300 3.7597 2.7894 2.1500 4.4316 2.2022 4.4215 3.9579 3.2470 3.7198 3.5871 1.1059 2.9321 3.1409 2.8517 3.9796 3.8248 3.7225 3.6311 1.5282 2.2755 4.7247 4.2738 4.7444 3.6114 3.7443 3.9119 5.1268 2.3771 4.1249 4.2166 4.2382 3.5650 1.7167 2.7488 9.1309 1.9287 5.1315 2.0763 3.6408 2.9498 2.6150 1.9747 1.9646 2.4767 3.1103 2.5157 2.5891 1.4370 1.3582 2.5428 6.7905 6.9146 1.5024 5.8444 2.7461 2.7141 2.1700 3.8106 1.2554 1.2429 1.2445 2.3892 1.3800 1.4227 1.3642 1.2611 1.2808 1.2164 1.2324 1.1576 1.2716 3.0463 1.1294 1.3183 1.2270 1.4418 1.2362 1.4511 1.2030 1.4109 1.1955 1.0935 1.1280 1.1217 1.1121 1.0476 1.0851 1.0914 1.0541 1.0876 1.0515 1.0569 1.0599 1.0550 1.0529 1.0790 1.0539 10.1557 4.6961 1.0654 1.0570 1.0314 1.0315 1.0306 1.0931 1.0979 1.0597 1.0364 1.0697 1.0568 1.1033 1.0970 1.1009 1.1028 1.1016 1.0971 1.0903 1.1008 1.0639 1.1037 1.1031 1.1045 1.1008 1.1162 1.0660
irintensity: 0.6774 0.1230 0.7424 0.8016 5.5167 1.7105 0.5864 0.0922 4.4849 1.9330 2.7974 0.1831 1.7410 0.8906 0.2495 4.4845 2.5664 9.2596 2.3104 19.4236 0.4963 6.2205 2.2797 3.6086 7.5531 1.4574 11.6122 6.4529 43.3544 106.6397 13.9310 14.4069 15.1315 14.0281 9.6587 36.2486 32.4763 5.9045 2.8544 1.5346 9.6606 2.7466 13.3392 28.1291 115.1555 90.6887 3.5516 10.1653 57.8494 60.9744 17.7607 5.8748 0.6034 11.4295 78.8682 47.8928 4.5706 11.0112 14.8913 69.3567 241.7676 166.8542 9.6132 326.5776 28.9051 29.3240 64.9989 309.5055 1.5861 0.2708 3.5123 37.9515 18.7860 31.3690 18.9973 11.4340 25.0811 20.3463 9.1039 20.9288 12.3810 71.5657 5.9250 38.8621 19.7604 1.4123 11.1817 3.9707 24.9441 0.8252 9.6141 6.7117 1.2051 0.1744 0.8500 11.0039 15.5719 19.9443 0.0616 5.9921 13.3372 49.8894 14.7027 1.4126 2.5020 4.3047 11.3151 182.0508 6.2112 75.3847 70.2104 60.3158 124.1007 80.9121 75.4902 15.0716 21.8564 17.8882 55.0865 30.5118 47.1982 9.7793 48.5912 34.8662 14.7371 16.4090 11.5514 35.4862 37.2687 31.4433 24.3921 18.4161 22.8734 13.2900 8.9671
temp: 298.150 k
press: 1.00000 atm
elementType: 14 8 8 8 8 8 8 8 6 6 6 6 6 6 6 6 6 6 6 6 6 1 1 1 1 1 1 1 1 1 1 1 1 1 1 1 1 1 1 1 1 1 1 1 1 1 1
symmnumber: 1
zpe: 1005647.6 jmol-1
zpe.correction: 0.383031 hartree
zpe.thermalcorrener: 0.410911 hartree
zpe.thermalcorrenthalpy: 0.411855 hartree
zpe.thermalcorrgfe: 0.321045 hartree
zpe.sumelectzpe: -1325.239077 hartree
zpe.sumelectthermal: -1325.211197 hartree
zpe.sumelectthermalent: -1325.210253 hartree
zpe.sumelectthermalfe: -1325.301062 hartree
dipole: -0.4458 -0.1238 -0.1859
dipole: 0.4986
quadrupole: -136.5655 -120.6031 -129.6093
quadrupole: -7.5288 3.0238 -4.2523
quadrupole: -7.6396 8.3229 -0.6833 -7.5288 3.0238 -4.2523
hfenergy: -1325.6221075 hartree
pointgroup: C01 [X(C13H26O7Si1)]
dipole: 0.1812684 0.0733332 -0.0156014 debye
polarizability: 228.080367|-9.8944134|167.5001688|-1.4685207|13.4259033|167.377363 unknown
InChI: InChI=1S/C13H26O7Si/c1-11(2)13(15)20-10-12(14)9-19-7-6-8-21(16-3,17-4)18-5/h12,14H,1,6-10H2,2-5H3
charge 0 multiplicity 1
47 atoms
Si 2.760821 0.474542 0.821181
O  -1.584017 1.732656 -0.499335
O  2.873631 -0.474877 -0.622836
O  2.909823 -0.537453 2.211707
O  4.09019 1.551035 0.95663
O  -5.095496 1.57287 0.73708
O  -2.828302 -1.042894 -0.510187
O  -0.789707 -1.254368 0.611134
C  1.144802 1.434641 0.727302
C  0.825781 2.087749 -0.639025
C  -0.545489 2.775499 -0.626237
C  -2.836648 2.23981 0.050001
C  -3.889437 1.116118 0.018382
C  -3.401703 -0.23433 0.591807
C  4.096994 -1.108592 -1.10652
C  2.104445 -1.729177 2.494884
C  5.334751 1.327466 1.686627
C  -1.485619 -1.432533 -0.419825
C  -1.040895 -2.081512 -1.695079
C  -2.09587 -2.519314 -2.691654
C  0.299082 -2.208982 -1.905824
H  1.186588 2.208863 1.519341
H  0.325401 0.739273 0.986857
H  1.592797 2.842767 -0.901503
H  0.835594 1.32262 -1.436984
H  -0.721218 3.345615 -1.563462
H  -0.614037 3.479464 0.233616
H  -2.677098 2.572708 1.105848
H  -3.215129 3.109152 -0.528899
H  -4.237583 0.94228 -1.012236
H  -2.646699 -0.120362 1.390956
H  -4.280361 -0.792551 0.958428
H  4.846166 -0.346385 -1.396209
H  4.539302 -1.78121 -0.344097
H  3.826163 -1.703191 -1.995144
H  1.06085 -1.621123 2.144556
H  2.552469 -2.61575 2.006185
H  2.119371 -1.874763 3.588212
H  5.744409 2.319587 1.941317
H  5.156955 0.746548 2.610462
H  6.066821 0.788533 1.053103
H  -4.840757 1.846582 1.656344
H  -2.818995 -3.216729 -2.231266
H  -2.679891 -1.65328 -3.050671
H  -1.628036 -3.016325 -3.558574
H  0.672301 -2.6613 -2.832685
H  1.03988 -1.827474 -1.19271
