program: Gaussian 09
title: 000100836
version: EM64L-G09RevD.01
frameworkgroup: C1[X(C12H20O)]
method: RPBEPBE
basis: SDD
operation: Freq
keyword: #pfreq=noraman
keyword: PBEPBE/SDD
title: #p freq=noraman PBEPBE/SDD
converged: YES YES NO NO
title: Mulliken charges:
elementType: O C C C C C C C C C C C C H H H H H H H H H H H H H H H H H H H H
charge: -0.438309 -0.355823 -0.356212 -0.389838 -0.398820 -0.481798 -0.327440 -0.142066 -0.296007 -0.059749 -0.455814 0.037575 -0.657922 0.217378 0.185269 0.191764 0.185717 0.197783 0.202679 0.184035 0.219654 0.202099 0.211711 0.181321 0.215386 0.239065 0.328729 0.227334 0.232135 0.233755 0.226045 0.225936 0.214425
chargesum: 0.00000
title: Mulliken charges with hydrogens summed into heavy atoms:
elementType: O C C C C C C C C C C C C
charge: -0.109580 0.046825 0.021270 0.010625 0.004868 -0.067988 0.069266 0.096999 -0.068672 -0.059749 0.010077 0.037575 0.008485
polarizability: 1.85431367e+02 3.55541551e+01 1.40131676e+02 -1.41765796e+00 -2.46889875e+00 1.06280611e+02
1716.lowfreq: -19.7098 -3.5142 -0.0008 -0.0008 -0.0006 4.7736 11.7266 19.7939 33.7343
frequency: -19.4127 19.6423 33.4798 51.1598 58.8006 83.6856 95.8953 110.9918 111.2722 143.5305 174.6137 199.1339 232.1520 259.8062 294.3726 321.3510 327.4595 365.5752 394.9054 425.3695 475.6305 515.1827 529.9745 725.0569 750.6260 763.2936 777.4177 801.6156 826.4782 873.3471 919.6579 951.5649 959.2683 964.9458 990.1454 1003.5461 1041.5079 1050.8943 1060.4729 1073.4848 1080.7104 1092.3348 1101.6887 1145.4866 1180.0286 1188.6531 1216.3566 1244.4957 1251.7280 1260.6395 1280.3642 1283.4315 1286.8487 1295.2015 1297.1415 1312.7615 1327.8897 1331.8954 1353.3749 1360.6160 1383.3262 1387.2554 1456.3033 1460.4619 1461.5154 1464.1980 1466.5615 1472.4787 1478.1682 1484.9302 1486.7841 1642.1845 2251.0771 2944.2369 2953.6949 2953.8666 2958.8131 2962.9572 2969.5715 2973.2291 2990.1657 2995.7684 3008.6197 3018.9463 3021.6730 3032.0864 3044.9100 3072.0771 3072.3445 3089.4899 3097.3928 3099.3223 3559.7414
redmass: 2.2424 4.9066 1.6235 3.1662 4.2158 2.9140 3.5114 2.4720 1.7803 2.4105 2.8600 1.7315 2.1873 3.0570 2.4952 1.1887 2.7526 3.0943 3.9429 3.3113 4.1400 4.2590 3.2764 1.1050 1.7328 1.5397 1.1749 1.6845 1.3234 2.0998 1.5207 3.2048 1.9589 1.3660 2.0862 1.9418 3.4880 2.8622 1.8912 2.1058 1.4664 2.4305 1.4103 1.7656 1.3709 2.1662 1.4620 1.2810 1.1464 1.3545 1.2067 1.2381 1.1042 1.1131 1.2663 1.4571 1.3710 1.4198 1.4069 1.6241 1.2584 1.1933 1.0962 1.0792 1.0769 1.0646 1.0882 1.0418 1.0928 1.0554 1.0974 6.4842 11.7715 1.0688 1.0602 1.0599 1.0628 1.0635 1.0613 1.0585 1.0350 1.0943 1.0994 1.1006 1.0986 1.0987 1.1020 1.0893 1.0977 1.1003 1.0895 1.1014 1.0661
irintensity: 0.0158 0.4204 3.6235 1.2618 1.0565 1.4379 0.5002 3.5443 2.3843 1.8353 0.2585 1.2694 1.8570 1.0123 2.4139 162.1705 7.7066 2.2761 2.0222 2.8156 6.9907 1.9367 1.0719 12.7166 0.6366 2.2517 6.5965 2.5757 10.6797 3.6656 17.4940 24.6603 59.8039 41.3679 0.2402 6.5742 32.3995 9.4832 8.2002 1.7931 0.6225 1.0197 27.9806 1.0616 3.1625 4.9144 13.0664 5.9041 0.3580 4.8735 1.5819 2.8715 1.1254 2.4979 1.2980 16.6346 4.3994 4.1183 4.5291 2.2956 24.1356 7.5658 17.1375 1.0673 7.5673 0.0528 0.1561 11.8429 1.5334 7.9232 15.9154 0.1831 5.0116 50.0323 21.9204 17.9815 10.0051 25.7952 132.0641 31.4348 50.2451 11.2561 13.1199 10.9143 14.1722 10.6334 123.3069 11.7252 71.7205 49.2468 30.8311 39.7591 6.2564
temp: 298.150 k
press: 1.00000 atm
elementType: 8 6 6 6 6 6 6 6 6 6 6 6 6 1 1 1 1 1 1 1 1 1 1 1 1 1 1 1 1 1 1 1 1
symmnumber: 1
zpe: 755819.2 jmol-1
zpe.correction: 0.287876 hartree
zpe.thermalcorrener: 0.303998 hartree
zpe.thermalcorrenthalpy: 0.304942 hartree
zpe.thermalcorrgfe: 0.241488 hartree
zpe.sumelectzpe: -543.375641 hartree
zpe.sumelectthermal: -543.359520 hartree
zpe.sumelectthermalent: -543.358575 hartree
zpe.sumelectthermalfe: -543.422029 hartree
dipole: -0.8908 1.7179 0.7863
dipole: 2.0888
quadrupole: -83.8063 -84.5488 -76.2959
quadrupole: 17.1796 8.2167 -2.1353
quadrupole: -2.2560 -2.9985 5.2544 17.1796 8.2167 -2.1353
hfenergy: -543.6635173 hartree
pointgroup: C01 [X(C12H20O1)]
dipole: -0.3558007 0.6745989 0.3060136 debye
polarizability: 185.2079621|35.7309179|140.3761145|-0.6231376|-2.114112|106.259577 unknown
InChI: InChI=1S/C12H20O/c1-2-3-4-5-6-7-8-9-10-11-12-13/h5-6,13H,2,7-12H2,1H3
charge 0 multiplicity 1
33 atoms
O  5.740994 -2.423791 0.209383
C  1.87798 0.887658 0.203904
C  3.265264 0.512595 -0.364855
C  1.302617 2.182137 -0.40981
C  3.835954 -0.788144 0.245056
C  -0.104665 2.554548 0.142202
C  5.214722 -1.158157 -0.330788
C  -1.174481 1.558896 -0.243305
C  -1.948581 0.864194 0.645868
C  -2.962116 -0.085557 0.296997
C  -4.903895 -1.899635 -0.254021
C  -3.844059 -0.922422 0.054958
C  -6.313587 -1.255558 -0.366534
H  1.169836 0.053014 0.030694
H  1.95198 1.008026 1.305315
H  3.189167 0.397289 -1.46629
H  3.974202 1.349226 -0.188624
H  1.243258 2.072608 -1.512489
H  1.997063 3.024564 -0.215131
H  3.915579 -0.67196 1.347441
H  3.138419 -1.628646 0.062985
H  -0.056891 2.649386 1.245155
H  -0.378016 3.554849 -0.254935
H  5.936117 -0.328094 -0.162031
H  5.145583 -1.337405 -1.417426
H  -1.323959 1.388632 -1.320173
H  5.814043 -2.341264 1.193912
H  -1.790101 1.037278 1.721929
H  -4.920517 -2.68265 0.529957
H  -4.659963 -2.415751 -1.203806
H  -6.596163 -0.765682 0.581147
H  -6.332377 -0.493113 -1.164149
H  -7.069609 -2.02667 -0.601134
