program: Gaussian 09
title: 000100834
version: EM64L-G09RevD.01
frameworkgroup: C1[X(C9H13Br)]
method: RPBEPBE
basis: SDD
operation: Freq
keyword: #pfreq=noraman
keyword: PBEPBE/SDD
title: #p freq=noraman PBEPBE/SDD
converged: YES YES NO NO
title: Mulliken charges:
elementType: Br C C C C C C C C C H H H H H H H H H H H H H
charge: -0.041188 -0.312690 -0.459603 -0.679584 -0.145309 -0.290421 -0.454636 -0.656586 -0.059431 0.045075 0.231381 0.243762 0.207024 0.208681 0.275894 0.278712 0.244668 0.228020 0.234032 0.234343 0.225479 0.226862 0.215517
chargesum: 0.00000
title: Mulliken charges with hydrogens summed into heavy atoms:
elementType: Br C C C C C C C C C
charge: -0.041188 0.162453 -0.043898 -0.124978 0.099358 -0.062400 0.013738 0.011271 -0.059431 0.045075
polarizability: 2.05288417e+02 1.74319106e+00 9.23491196e+01 9.02370259e+00 -9.99475421e-01 7.57448948e+01
1716.lowfreq: -13.8625 -4.9120 -0.0004 0.0001 0.0005 4.7098 13.5029 30.7920 48.7208
frequency: -11.3138 30.7706 48.7004 67.5529 85.1251 115.6153 140.3455 177.4593 199.6136 217.2126 281.4419 331.5113 377.0033 433.1688 467.5150 542.4626 623.3238 741.4452 760.1383 775.9550 809.2374 844.4820 956.6417 964.3356 992.7847 1005.4004 1044.4933 1063.1515 1069.9025 1078.3608 1136.9979 1189.9142 1215.2087 1242.4742 1249.4604 1267.7432 1278.3830 1294.0243 1307.3075 1318.1646 1339.1755 1389.3593 1448.7883 1459.8019 1461.0549 1473.4314 1477.3836 1484.7823 1643.4046 2251.5135 2955.9415 2970.3053 2990.8397 3007.8241 3013.9732 3023.2540 3046.2685 3071.0403 3072.7411 3090.0987 3098.7784 3106.6439 3131.5328
redmass: 2.2210 5.1303 2.4746 2.5858 3.0980 2.6372 2.4991 3.9257 2.2086 2.5937 2.0158 3.3927 3.3318 4.5289 4.9930 4.9045 4.8292 1.2986 1.8779 1.1797 1.6166 1.6566 1.3677 1.5131 1.9464 3.5308 1.9941 1.9521 2.0106 1.4475 1.7098 2.3486 1.1712 1.3499 1.1499 1.2338 1.1674 1.1933 1.2869 1.5931 1.4419 1.1938 1.1022 1.0757 1.0866 1.0415 1.0955 1.0541 6.4829 11.7751 1.0618 1.0588 1.0350 1.0611 1.1001 1.0962 1.0563 1.1039 1.0891 1.1003 1.1014 1.0902 1.1110
irintensity: 0.2059 0.3551 0.7761 2.5925 1.7540 0.3248 3.0718 1.1763 1.2333 1.0123 3.5766 3.1224 6.9023 5.6079 3.9394 3.7280 26.4628 7.9837 5.9027 7.1424 2.9334 3.6082 33.7982 28.1856 18.7936 2.3359 11.0036 3.6717 0.6041 1.0296 0.0125 2.1902 10.1427 4.1213 0.5735 23.7948 0.9607 4.2895 4.7305 54.5703 1.4252 9.2446 1.4835 6.2230 3.0787 12.3418 13.9023 7.9924 0.4451 13.8503 33.6378 37.0332 40.5292 11.0397 10.9067 15.3380 26.2461 18.5699 19.1916 46.0009 36.0199 28.6708 18.9448
temp: 298.150 k
press: 1.00000 atm
elementType: 35 6 6 6 6 6 6 6 6 6 1 1 1 1 1 1 1 1 1 1 1 1 1
symmnumber: 1
zpe: 500952.8 jmol-1
zpe.correction: 0.190803 hartree
zpe.thermalcorrener: 0.202882 hartree
zpe.thermalcorrenthalpy: 0.203826 hartree
zpe.thermalcorrgfe: 0.149529 hartree
zpe.sumelectzpe: -363.369229 hartree
zpe.sumelectthermal: -363.357149 hartree
zpe.sumelectthermalent: -363.356205 hartree
zpe.sumelectthermalfe: -363.410502 hartree
dipole: -2.4545 1.2393 0.5064
dipole: 2.7958
quadrupole: -70.4971 -69.3820 -70.0793
quadrupole: 8.2401 1.6788 -1.0323
quadrupole: -0.5110 0.6042 -0.0932 8.2401 1.6788 -1.0323
hfenergy: -363.5600314 hartree
pointgroup: C01 [X(C9H13Br1)]
dipole: -0.9179724 -0.5411022 -0.2728866 debye
dipolederiv: -0.5961484 -0.1592351 -0.0535743 -0.3412894 -0.3182219 -0.0561873 -0.119466 -0.0543107 -0.1721621 -0.1975116 -0.0157981 -0.00689 -0.0521639 -0.0544207 -0.0834911 -0.0886354 -0.0584565 0.1105632 -0.2029597 -0.057262 -0.0331032 0.0581577 0.1753229 0.0492381 0.104976 0.0024543 0.1740516 0.6854406 0.3400457 0.1051301 0.3481193 0.422175 0.1038556 0.1375698 0.1030135 0.1691107 0.1527142 -0.0152431 -0.0522245 -0.2498992 -0.1150906 -0.176955 -0.0216632 -0.1729949 -0.0577064 0.3192376 -0.1105206 -0.0503241 -0.2088492 0.0586032 -0.1335055 0.0633532 -0.1577387 0.0026697 0.1645296 0.0075907 0.0023702 -0.0490661 0.1154789 0.0429565 -0.0170448 0.0341491 0.1677952 -0.0244411 0.0363336 -0.0056459 -0.0659879 0.0375242 0.031406 0.0645074 0.0166709 0.0607191 -0.3561095 0.0463739 0.0170916 0.1143422 -0.1374169 0.0424684 -0.0079521 0.0541228 -0.115442 0.1546351 -0.099353 0.0082741 0.0121753 -0.1626948 0.0065082 -0.0331591 0.0275421 -0.1529128 0.0718412 0.0173388 -0.0317462 0.0504211 -0.0426026 0.0906225 -0.0113213 0.1079473 -0.0079549 0.0608849 0.0076526 0.0417907 0.0362106 0.0472886 -0.059489 0.0436915 -0.072832 -0.0774673 -0.0511473 0.0516397 0.0997169 0.0684584 0.0503499 -0.0696114 0.0595863 -0.0953849 -0.0976135 0.044605 0.0014279 -0.0041393 0.0298617 -0.0703499 0.0906948 -0.0575618 0.1389722 -0.0178971 -0.0098139 -0.0624761 -0.0124771 -0.0259056 -0.0148906 -0.0967016 0.0485351 -0.0970281 -0.066486 -0.0009013 -0.0772313 -0.0177092 -0.0184279 -0.1014534 0.0725631 -0.0617355 0.0639668 0.0172046 0.0187033 0.0343822 -0.0084028 0.0856465 0.0232941 0.1271547 -0.0185096 0.1240342 0.044794 -0.0089615 0.0988612 -0.0397342 0.0977422 0.0213469 0.1173662 -0.0537526 0.112999 0.0611409 -0.1246822 -0.0573511 -0.0427956 -0.0293785 -0.0529443 -0.0532304 -0.1062869 -0.0636365 0.0699984 -0.0456187 0.0340999 0.067706 0.0985817 0.0721323 0.0009846 0.0954868 0.0236576 -0.1071944 0.1042267 -0.0048593 0.0859974 -0.0002215 0.0679153 -0.015198 0.0432504 0.0239693 -0.1348522 0.0665503 -0.1148254 -0.0646081 -0.0690291 -0.0588871 -0.0528161 -0.051666 -0.0835468 0.0326137 -0.2250733 0.0984088 -0.0047026 0.1105015 0.0375416 0.0213669 -0.0122023 0.02243 0.0970276 unknown
polarizability: 205.3033464|7.4865312|92.8900955|-4.2657869|-0.0482775|75.1889894 unknown
InChI: InChI=1S/C9H13Br/c1-2-3-4-5-6-7-8-9-10/h5-6H,2,7-9H2,1H3
charge 0 multiplicity 1
23 atoms
Br 5.57655 1.300261 0.436341
C  2.850029 0.263313 -0.05479
C  1.887858 -0.901719 -0.445684
C  4.303541 -0.213146 -0.051392
C  0.448682 -0.44461 -0.507754
C  -0.55159 -0.951976 0.275491
C  -4.534274 0.194141 0.254928
C  -4.77041 1.560549 -0.443527
C  -1.920418 -0.534395 0.2438
C  -3.118273 -0.21574 0.259711
H  2.731701 1.097541 -0.771311
H  2.574301 0.65001 0.942752
H  2.198005 -1.295324 -1.436999
H  1.989705 -1.733093 0.279055
H  4.643797 -0.551649 -1.042928
H  4.496424 -0.990399 0.704586
H  0.211481 0.353475 -1.226031
H  -0.300316 -1.74902 0.992915
H  -5.139235 -0.586368 -0.249241
H  -4.904318 0.24376 1.298523
H  -4.441857 1.523258 -1.496511
H  -4.205355 2.361604 0.063462
H  -5.843728 1.822128 -0.421294
