program: Gaussian 09
title: 000100832
version: EM64L-G09RevD.01
frameworkgroup: C1[X(C6H9F3N2O2)]
method: RPBEPBE
basis: SDD
operation: Freq
keyword: #p
keyword: freq=noraman
keyword: PBEPBE/SDD
title: #p freq=noraman PBEPBE/SDD
converged: YES YES NO NO
title: Mulliken charges:
elementType: F F F O O N N C C C C C C H H H H H H H H H
charge: -0.182894 -0.141384 -0.138210 -0.245722 -0.170946 -0.032156 -0.375360 -0.352468 -0.348357 -0.307267 -0.308171 0.185001 0.330516 0.240644 0.200324 0.201907 0.240937 0.224943 0.212363 0.212866 0.225094 0.328340
chargesum: 0.00000
title: Mulliken charges with hydrogens summed into heavy atoms:
elementType: F F F O O N N C C C C C C
charge: -0.182894 -0.141384 -0.138210 -0.245722 -0.170946 -0.032156 -0.047020 0.088501 0.094487 0.130039 0.129788 0.185001 0.330516
polarizability: 1.03932831e+02 8.98331092e-01 7.72798230e+01 4.01510116e+00 1.26262825e+00 7.83795816e+01
1716.lowfreq: -18.7314 -11.9954 -0.0015 -0.0015 -0.0014 4.0101 9.0979 24.4077 57.7251
frequency: -8.9009 24.0796 57.5421 62.7438 176.0670 203.7236 229.2598 236.3225 269.7976 338.3647 372.0020 394.8722 396.5941 439.0036 444.9119 476.5572 506.6989 603.6536 620.7324 637.8399 710.6280 755.8009 805.1542 841.2131 850.8571 903.2142 985.8742 1008.9877 1017.6418 1039.6874 1054.7932 1062.7502 1077.1536 1100.0204 1150.6403 1155.9540 1188.0994 1224.2717 1257.1399 1268.3501 1283.5687 1329.7804 1346.7897 1352.4282 1370.9555 1446.1977 1450.5397 1454.4248 1460.6641 1514.5861 1676.3516 2891.5648 2901.3364 2973.2516 2975.7009 3063.4384 3066.0061 3093.1294 3096.1342 3383.7179
redmass: 4.6594 12.4139 5.7505 6.2290 5.5065 5.7262 3.8960 2.6635 10.8520 3.2418 12.4136 2.1202 4.4984 9.2774 7.7195 3.0823 8.7278 2.4933 1.3270 6.8400 7.2810 4.8914 3.9176 1.5626 7.3177 2.2563 3.5163 8.5512 2.2429 12.4973 2.1376 3.3925 3.8119 2.4326 3.7161 3.9292 1.0632 3.2674 1.4338 1.3939 1.2113 1.2626 1.2577 1.3557 1.2553 1.0787 1.0779 1.0963 1.1155 1.5277 11.5407 1.0701 1.0689 1.0661 1.0660 1.0904 1.0931 1.0976 1.0993 1.0764
irintensity: 0.5716 1.2381 2.0389 2.6751 7.8746 5.0427 0.2371 6.6165 4.4798 7.8645 4.4721 0.7137 1.6654 20.6696 3.8838 0.4057 2.9998 3.0531 93.7879 15.4153 1.8062 5.4429 9.7793 0.9780 73.8169 3.8504 112.6428 151.9964 6.6823 215.7499 54.5784 66.4912 59.2458 60.7220 0.8161 44.7497 1.4966 21.7564 24.0167 7.3781 4.1122 0.5926 9.5518 6.6948 1.8207 3.4825 0.7884 23.1807 1.1477 52.0795 260.1386 45.5030 89.6890 26.0558 82.0955 26.5527 16.4307 28.9051 23.1673 28.7887
temp: 298.150 k
press: 1.00000 atm
elementType: 9 9 9 8 8 7 7 6 6 6 6 6 6 1 1 1 1 1 1 1 1 1
symmnumber: 1
zpe: 419168.9 jmol-1
zpe.correction: 0.159653 hartree
zpe.thermalcorrener: 0.171321 hartree
zpe.thermalcorrenthalpy: 0.172265 hartree
zpe.thermalcorrgfe: 0.120392 hartree
zpe.sumelectzpe: -792.438508 hartree
zpe.sumelectthermal: -792.426840 hartree
zpe.sumelectthermalent: -792.425896 hartree
zpe.sumelectthermalfe: -792.477769 hartree
dipole: -2.8167 -0.5406 -2.7032
dipole: 3.9413
quadrupole: -90.2035 -68.4079 -79.5920
quadrupole: -0.4856 -4.5741 -1.5499
quadrupole: -10.8024 10.9932 -0.1909 -0.4856 -4.5741 -1.5499
hfenergy: -792.5981611 hartree
pointgroup: C01 [X(C6H9F3N2O2)]
dipole: -1.1146543 0.099456 1.0733367 debye
dipolederiv: -0.5163131 -0.0041223 -0.0719685 0.0009846 -0.2965263 -0.0695276 -0.0116369 -0.0705247 -0.8638802 -0.5784505 0.2528916 0.0178069 0.2388435 -0.6615182 -0.0770788 -0.0095958 -0.0495656 -0.2716612 -0.6055965 -0.2531476 0.0894218 -0.2336024 -0.5761965 0.1506417 0.0554785 0.1248999 -0.3182839 -0.547985 0.0046152 -0.0724441 0.0023186 -0.8120224 0.0036908 -0.0619733 0.0028184 -0.4051971 -0.5191591 -0.0004479 -0.0430657 0.0369459 -0.2828639 -0.0531183 0.4040224 -0.0469174 -0.9013318 -0.1169269 0.0065315 0.0093605 0.0049035 -0.2554564 -0.0058899 0.2478179 -0.0084467 -0.4485519 -0.5373839 0.0311127 0.4540083 0.0454659 -0.4558653 -0.0187582 0.322512 -0.0118367 -0.3406545 -0.0191118 -0.2164664 -0.0965968 -0.2471584 0.2793554 0.1143905 -0.1691601 0.0788193 0.381544 -0.0264634 0.2088795 -0.0933835 0.2427117 0.2741851 -0.1183725 -0.1506988 -0.0731873 0.3676313 0.3538934 0.2017711 0.0229638 0.1450852 0.5409431 -0.0636306 0.0911256 -0.1252644 0.3490289 0.3598401 -0.2073656 0.0258515 -0.1488285 0.5347921 0.060357 0.08806 0.1205441 0.344769 1.0212743 -0.030465 -0.2832623 -0.0698328 0.0954441 0.0927832 -0.7475369 0.0875809 1.2321136 1.5092473 -0.0015235 -0.1264313 -0.0050884 1.5556614 -0.0144053 -0.1014278 -0.0153461 1.3274561 0.0346491 -0.1145521 0.0287922 -0.0486798 -0.0696676 0.034407 0.0455239 0.04451 0.0559862 0.00791 0.0542859 -0.026418 0.0655257 0.0109834 0.0355403 0.0246562 -0.1112254 -0.2313656 0.0133186 -0.0562152 -0.0219882 -0.0665028 0.009125 -0.0382542 0.0253746 0.1064576 -0.2290765 0.0290681 0.1158622 0.0281122 0.0534 -0.0623689 -0.0298134 0.0450226 -0.0414607 0.0576634 -0.0226571 0.0851866 0.029017 0.07208 -0.0871825 -0.0292188 0.042354 -0.0667175 0.0804387 0.0452626 -0.0697607 0.0291085 -0.0473086 0.0211436 -0.0339854 -0.0243025 0.0790521 -0.1802778 0.0420767 0.0711695 0.0273524 0.0476939 0.0238826 0.0322882 -0.0227216 -0.0805825 -0.1778599 -0.0177112 -0.0810773 0.0293838 -0.0687252 -0.0896711 0.0323049 0.040643 0.0702095 0.0797539 0.0912181 0.0028378 0.0443797 -0.0202315 0.3038233 -0.0043509 -0.133537 -0.0138167 0.0917555 unknown
polarizability: 103.9805281|-0.5267909|77.0245862|-3.928409|1.1214235|78.587121 unknown
InChI: InChI=1S/C6H9F3N2O2/c7-6(8,9)5(12)10-11-1-3-13-4-2-11/h10H,1-4H2
charge 0 multiplicity 1
22 atoms
F  2.631143 0.174177 1.591789
F  3.418014 -1.196268 -0.042135
F  3.502412 1.051684 -0.315339
O  -3.930476 -0.01804 0.235654
O  1.249179 -0.135664 -1.772055
N  -1.069878 0.024508 -0.054905
N  0.279822 0.05128 0.381779
C  -1.802543 1.255011 0.357335
C  -1.765181 -1.223607 0.375435
C  -3.228556 1.191247 -0.221017
C  -3.191422 -1.211545 -0.204994
C  1.315939 -0.033564 -0.527223
C  2.714031 -0.000096 0.171362
H  -1.269933 2.133666 -0.045784
H  -1.85816 1.344585 1.469786
H  -1.817108 -1.298401 1.488512
H  -1.204939 -2.090207 -0.015984
H  -3.831609 2.041876 0.134869
H  -3.178727 1.204186 -1.329894
H  -3.140186 -1.237312 -1.313558
H  -3.768827 -2.075212 0.16169
H  0.492403 0.121994 1.389274
