program: Gaussian 09
title: 000100860
version: EM64L-G09RevD.01
frameworkgroup: C1[X(C11H10Br6)]
method: RPBEPBE
basis: SDD
operation: Freq
keyword: #p
keyword: freq=noraman
keyword: PBEPBE/SDD
title: #p freq=noraman PBEPBE/SDD
converged: YES YES NO NO
title: Mulliken charges:
elementType: Br Br Br Br Br Br C C C C C C C C C C C H H H H H H H H H H
charge: 0.091209 0.002769 0.001905 0.001908 0.013872 0.013872 0.316542 0.296509 0.296509 0.555242 0.555252 -0.662353 -0.969338 -0.962589 -0.962601 -0.937105 -0.937102 0.332149 0.332148 0.333890 0.333900 0.333892 0.333902 0.323611 0.319197 0.323612 0.319197
chargesum: 0.00000
title: Mulliken charges with hydrogens summed into heavy atoms:
elementType: Br Br Br Br Br Br C C C C C C C C C C C
charge: 0.091209 0.002769 0.001905 0.001908 0.013872 0.013872 0.316542 0.296509 0.296509 0.555242 0.555252 -0.662353 -0.305041 -0.294798 -0.294807 -0.294297 -0.294293
polarizability: 2.66045700e+02 1.06959958e-01 2.66611279e+02 6.76324902e-02 8.48985851e+00 1.93159090e+02
1716.lowfreq: -4.7189 -4.4733 -3.7313 -0.0004 -0.0004 -0.0003 22.8123 23.5459 34.0842
frequency: 22.7969 23.5369 34.0838 38.0273 38.6203 45.5289 48.7442 52.1965 68.4379 78.1283 103.4241 135.2196 144.6472 228.8149 236.9605 255.3391 328.9914 331.0494 369.9830 377.3053 393.9976 419.5850 480.0300 489.2751 492.6052 527.8288 540.6695 553.0307 575.4270 603.0409 621.5906 689.1178 721.6359 738.8245 815.2879 831.3668 878.1720 888.9871 901.6232 923.2163 948.2204 996.8682 1068.2938 1102.5390 1104.4785 1140.3156 1142.7083 1162.0739 1212.2347 1217.9472 1223.1365 1230.7422 1232.7372 1241.9955 1310.3883 1362.7928 1404.4685 1419.4374 1460.4054 1461.2066 1478.8318 1500.0709 1522.4974 1547.0701 1568.5050 3082.2537 3082.6984 3083.5133 3085.1983 3085.7787 3155.7887 3158.7112 3160.6047 3164.1649 3164.3058
redmass: 39.8362 47.7150 51.8750 59.2460 60.1153 27.0848 30.3987 25.3119 8.8956 35.1755 24.1640 23.3374 6.7924 13.3736 5.7098 6.7302 8.5851 4.9422 2.4481 3.6609 2.5309 2.5927 8.4555 7.9581 7.3218 6.6301 6.7447 2.2551 6.5049 6.4701 5.5332 5.6057 6.4462 4.5391 2.1433 7.6665 1.7750 1.4502 1.2914 1.6441 1.8080 2.3885 2.1025 1.3479 1.1348 1.4689 1.4276 1.2716 1.1613 1.1358 1.1572 1.1596 2.1560 1.6929 6.7020 5.5369 5.8425 6.6321 1.1478 1.1176 1.1258 1.1142 1.1006 7.0987 8.5753 1.0584 1.0585 1.0587 1.0588 1.0590 1.1106 1.1099 1.1093 1.1090 1.1091
irintensity: 0.0620 0.0065 0.0078 0.0083 0.0083 0.9066 0.4356 1.0560 0.5088 0.0001 1.9872 3.2052 12.3257 2.9487 5.8457 15.2173 0.0132 4.1643 0.0425 7.0426 1.2848 0.0099 63.2344 44.7570 1.4822 44.2531 0.3534 0.2938 56.6431 0.1818 6.5246 17.9140 19.7570 5.8612 72.2284 1.5664 56.0425 14.2765 0.0067 3.0484 8.3913 45.2183 0.1860 1.3619 8.7977 3.7988 7.3288 3.2405 83.9968 1.1162 12.1793 44.3610 57.7036 7.8476 3.6004 0.4899 2.3996 8.7239 22.4551 4.4649 17.3096 32.8266 14.4234 32.5603 0.9199 2.1770 0.0385 4.4684 8.0078 2.2665 0.6270 2.1721 0.0787 0.4637 0.2068
temp: 298.150 k
press: 1.00000 atm
elementType: 35 35 35 35 35 35 6 6 6 6 6 6 6 6 6 6 6 1 1 1 1 1 1 1 1 1 1
symmnumber: 1
zpe: 474499.5 jmol-1
zpe.correction: 0.180727 hartree
zpe.thermalcorrener: 0.200446 hartree
zpe.thermalcorrenthalpy: 0.201390 hartree
zpe.thermalcorrgfe: 0.123971 hartree
zpe.sumelectzpe: -504.682819 hartree
zpe.sumelectthermal: -504.663100 hartree
zpe.sumelectthermalent: -504.662156 hartree
zpe.sumelectthermalfe: -504.739575 hartree
dipole: 0.0001 -0.0819 -1.6474
dipole: 1.6494
quadrupole: -165.3215 -164.4117 -160.4168
quadrupole: -0.0003 -0.0004 -6.0163
quadrupole: -1.9382 -1.0284 2.9665 -0.0003 -0.0004 -6.0163
hfenergy: -504.8635463 hartree
pointgroup: C01 [X(C11H10Br6)]
dipole: 0.0000514 0.0034489 -0.6489177 debye
polarizability: 266.0457741|0.1027469|265.4567868|0.078664|12.4715177|194.3135075 unknown
InChI: InChI=1S/C11H10Br6/c12-1-6-7(2-13)9(4-15)11(17)10(5-16)8(6)3-14/h1-5H2
charge 0 multiplicity 1
27 atoms
Br 0.001577 3.50256 -0.633789
Br -0.001484 -3.369774 2.132734
Br -3.336944 -1.963308 -1.536296
Br 3.335303 -1.966158 -1.536317
Br 3.312047 2.252702 1.355999
Br -3.310092 2.255562 1.355867
C  -0.000501 -1.233993 0.066144
C  -1.235294 -0.524877 -0.014493
C  1.234914 -0.525958 -0.014467
C  -1.246108 0.885668 -0.257128
C  1.246964 0.88458 -0.257082
C  0.000724 1.557352 -0.369667
C  -0.001166 -2.730914 0.17279
C  -2.531133 -1.24651 0.219285
C  2.530123 -1.248728 0.219291
C  2.549988 1.603728 -0.43766
C  -2.548503 1.605944 -0.437758
H  0.894402 -3.19936 -0.254935
H  -0.897142 -3.198556 -0.254962
H  -2.423204 -2.14168 0.844841
H  -3.320759 -0.605325 0.630856
H  2.421419 -2.143827 0.844812
H  3.320305 -0.608249 0.630889
H  3.34329 0.969902 -0.854332
H  2.451176 2.527386 -1.020679
H  -3.342332 0.97281 -0.854475
H  -2.44887 2.529522 -1.020765
