program: Gaussian 09
title: 000100823
version: EM64L-G09RevD.01
frameworkgroup: C1[X(C5H11N3O2)]
method: RPBEPBE
basis: SDD
operation: Freq
keyword: #p
keyword: freq=noraman
keyword: PBEPBE/SDD
title: #p freq=noraman PBEPBE/SDD
converged: YES YES NO YES
title: Mulliken charges:
elementType: O O N N N C C C C C H H H H H H H H H H H
charge: -0.251420 -0.286869 -0.173834 0.029731 -0.111306 -0.224950 -0.669553 0.351041 -0.618670 -0.648780 0.229740 0.229760 0.209995 0.232554 0.232553 0.262145 0.249767 0.249752 0.237699 0.237705 0.232940
chargesum: 0.00000
title: Mulliken charges with hydrogens summed into heavy atoms:
elementType: O O N N N C C C C C
charge: -0.251420 -0.286869 -0.173834 0.029731 -0.111306 0.234550 0.005549 0.351041 0.142993 0.059564
polarizability: 1.22595635e+02 1.31032862e+01 9.65364253e+01 -1.31322235e-02 5.67631474e-04 5.46485971e+01
1716.lowfreq: -170.0307 -16.8803 -10.3188 -9.6290 0.0005 0.0006 0.0009 34.1293 83.6244
frequency: -170.0291 33.7187 83.6218 97.6700 97.9430 144.5326 169.3892 199.9614 235.0645 241.7538 322.7110 334.5840 394.1925 399.1432 421.5894 520.2074 694.1595 713.2849 800.9582 811.4305 848.5362 972.5444 1007.9999 1027.4422 1046.8433 1093.5927 1114.3604 1116.4922 1131.5532 1135.0028 1200.5272 1248.6347 1321.1058 1365.2856 1376.7571 1399.8080 1407.1188 1420.7522 1460.3855 1460.4704 1463.4963 1468.5368 1474.3390 1480.9128 1488.0933 1618.9032 2977.7279 2998.5093 3008.8291 3013.3862 3066.9590 3073.4137 3092.3424 3095.6171 3111.5597 3117.4056 3150.8214
redmass: 1.0573 2.1208 6.9661 3.5214 2.3381 1.2587 2.6829 3.6250 3.4843 1.2643 3.5468 3.9106 5.2885 3.4461 6.2919 5.4163 11.3427 5.0539 1.0978 4.2031 4.8360 3.8688 2.8217 2.3001 1.3176 3.4199 2.0413 1.3120 2.3792 1.4510 3.5045 1.1379 2.2289 2.2634 1.9067 1.2978 1.2161 1.5162 1.0448 1.0403 1.1853 1.0462 1.0606 1.1146 1.0810 9.9932 1.0344 1.0358 1.0336 1.0580 1.1002 1.1069 1.1009 1.0985 1.1028 1.0996 1.1013
irintensity: 0.4153 0.0001 0.0866 0.8144 6.3360 2.4597 0.4261 4.8886 7.9296 0.5347 18.0340 25.0936 0.0200 6.8970 10.0807 11.2739 16.8787 1.9130 3.6400 6.8358 41.3801 43.4481 35.0058 20.2436 2.1486 285.4026 6.6838 0.2971 286.1222 5.5115 39.2914 0.0082 226.5763 106.7141 58.3863 24.9909 8.7375 88.9043 23.5050 6.2672 32.8274 14.8128 5.8658 31.5632 28.4996 314.3525 43.5611 19.1762 21.5175 22.0425 28.3607 8.1462 17.3777 30.1031 44.5301 24.3579 0.5328
temp: 298.150 k
press: 1.00000 atm
elementType: 8 8 7 7 7 6 6 6 6 6 1 1 1 1 1 1 1 1 1 1 1
symmnumber: 1
zpe: 440058.2 jmol-1
zpe.correction: 0.167609 hartree
zpe.thermalcorrener: 0.179099 hartree
zpe.thermalcorrenthalpy: 0.180043 hartree
zpe.thermalcorrgfe: 0.129369 hartree
zpe.sumelectzpe: -510.970043 hartree
zpe.sumelectthermal: -510.958553 hartree
zpe.sumelectthermalent: -510.957609 hartree
zpe.sumelectthermalfe: -511.008284 hartree
dipole: -0.1892 -1.8104 -0.0004
dipole: 1.8202
quadrupole: -50.4575 -60.6888 -58.5370
quadrupole: -2.5402 0.0038 -0.0001
quadrupole: 6.1036 -4.1277 -1.9759 -2.5402 0.0038 -0.0001
hfenergy: -511.1376526 hartree
pointgroup: C01 [X(C5H11N3O2)]
dipole: 0.0867103 -0.7108618 0.0001742 debye
dipolederiv: -1.3333029 -0.4518524 -0.0000268 -0.9619598 -0.8705137 0.0002105 -0.0006734 -0.0003935 -0.2712956 -0.9400262 0.2957126 0.0003623 0.2323129 -1.0203255 -0.0004756 -0.0002881 0.0005802 -0.3456398 -1.5198099 0.3509358 0.0001641 0.7531994 -0.7168727 -0.0002775 0.0004612 -0.0001323 -0.2007188 0.6180879 -0.5818577 -0.0002986 -0.9650008 0.4173628 0.0004617 -0.0001528 0.0005352 0.0039237 -0.8573226 0.5259418 0.0002538 -0.1457608 0.0424942 0.0000059 0.0007822 -0.0007063 -0.1900594 0.9991319 0.284911 0.0001083 0.2030439 0.3212744 0.0000202 0.0001114 0.0000697 0.3552597 -0.0294711 -0.0856921 0.0000015 -0.0791708 -0.0913618 -0.0000612 -0.0000284 -0.0000627 0.0569607 2.5951325 -0.2667055 -0.0006699 0.4751926 1.4496767 0.0002977 -0.0001527 -0.0001087 0.2951815 0.142251 0.0822465 0.0000305 0.2188447 0.1208754 -0.0000564 0.0002243 -0.0000674 0.2045315 0.3753043 -0.1905088 0.0000158 -0.0109942 0.0671923 -0.0000058 -0.0000149 0.0001041 0.1651821 -0.0663982 -0.0388105 0.0199454 0.0406308 0.0047634 -0.0910176 0.0599215 -0.0846078 -0.0605876 -0.0663719 -0.0389022 -0.0198904 0.0405284 0.0046849 0.0910431 -0.0598267 0.0845971 -0.0605539 -0.1772396 -0.0274114 -0.0000931 -0.0116104 0.0744652 0.0000012 -0.0001102 -0.0000141 0.1169418 0.1040923 0.0593008 0.0749824 0.006884 0.0228824 -0.0770397 0.0540014 -0.0980007 -0.0610393 0.1041827 0.0592574 -0.0748667 0.0068401 0.0228144 0.0770767 -0.0538733 0.0980811 -0.0610709 0.1098844 0.1246607 0.0000475 0.0478228 0.0294011 -0.0000028 0.0000409 -0.0000481 0.1338302 0.0072619 -0.0636074 0.0844434 0.0063891 0.0633772 -0.0364611 0.0932827 0.0210059 -0.0424053 0.0069496 -0.0637213 -0.0845714 0.0065358 0.0633819 0.0363851 -0.0934425 -0.0209561 -0.0421597 0.0465096 -0.0059689 -0.0817796 0.0823093 -0.0383954 -0.0883569 -0.016003 -0.1271999 -0.0544177 0.0463178 -0.0058191 0.0818828 0.0823192 -0.0381797 0.0882322 0.0158359 0.127217 -0.0545542 -0.1651637 0.0378907 -0.0000414 -0.0283561 0.0710025 0.0000206 -0.0000954 0.0001074 0.112691 unknown
polarizability: 123.0393789|-12.6465641|96.0926814|-0.0131205|-0.0007938|54.6485971 unknown
InChI: InChI=1S/C5H11N3O2/c1-4-10-5(9)8(3)7-6-2/h4H2,1-3H3
charge 0 multiplicity 1
21 atoms
O  -1.305415 -0.409291 0.000318
O  -1.278358 1.9322 -0.000157
N  0.72794 0.724293 -0.000182
N  1.296792 -0.553041 -0.000403
N  2.596188 -0.502115 -0.001262
C  -2.802383 -0.345875 -0.00022
C  -3.288483 -1.790471 -0.000658
C  -0.679727 0.826206 0.000841
C  1.554843 1.948097 -0.001158
C  3.175429 -1.876828 -0.000248
H  -3.128391 0.21305 0.89513
H  -3.12777 0.213379 -0.895592
H  -4.39341 -1.811493 -0.001056
H  -2.92869 -2.326605 -0.894984
H  -2.929328 -2.32693 0.893727
H  0.871898 2.808485 -0.000775
H  2.20382 1.962448 -0.89311
H  2.205293 1.96284 0.889711
H  2.861046 -2.446636 -0.894367
H  2.860738 -2.445656 0.894393
H  4.271266 -1.775758 -0.000148
