program: Gaussian 09
title: 000100829
version: EM64L-G09RevD.01
frameworkgroup: C1[X(C10H3F5N2O)]
method: RPBEPBE
basis: SDD
operation: Freq
keyword: #p
keyword: freq=noraman
keyword: PBEPBE/SDD
title: #p freq=noraman PBEPBE/SDD
converged: NO YES NO NO
title: Mulliken charges:
elementType: F F F F F O N N C C C C C C C C C C H H H
charge: -0.136770 -0.136637 -0.135576 -0.135529 -0.135222 -0.162504 -0.177857 -0.069532 -0.005481 0.182496 0.187382 0.185457 0.066759 0.066601 0.128182 -0.107999 -0.135722 -0.307577 0.270909 0.292358 0.266264
chargesum: 0.00000
title: Mulliken charges with hydrogens summed into heavy atoms:
elementType: F F F F F O N N C C C C C C C C C C
charge: -0.136770 -0.136637 -0.135576 -0.135529 -0.135222 -0.162504 -0.177857 -0.069532 -0.005481 0.182496 0.187382 0.185457 0.066759 0.066601 0.128182 0.162910 0.156636 -0.041313
polarizability: 1.69181125e+02 -8.09955034e-04 1.02307618e+02 -2.18596155e+00 2.50467277e-01 9.93970752e+01
1716.lowfreq: -21.1477 -8.1131 -4.4596 -0.0009 -0.0008 -0.0008 4.5556 49.0326 51.4500
frequency: -21.0685 49.0319 51.4391 119.1890 123.0000 124.8459 161.9113 174.1995 206.4888 237.7249 255.3353 261.2783 283.1747 283.6081 334.0879 370.6428 420.7149 421.6317 472.5699 536.7148 547.0941 578.7932 617.6720 628.9405 649.3389 653.9802 724.7184 726.0469 776.7008 778.2821 813.7725 863.7030 869.0739 924.6385 924.8004 984.8302 1032.1416 1073.9528 1077.1039 1103.5905 1205.7098 1220.0774 1237.5548 1273.8957 1357.7869 1364.7585 1377.7217 1443.8348 1447.3188 1461.0917 1497.3866 1599.6528 1622.1427 1628.1814 3236.8220 3258.1236 3268.0502
redmass: 10.1825 10.3594 4.6974 18.1301 11.7816 10.5951 15.6996 7.1129 12.9738 9.6991 18.8352 14.1238 17.8974 11.3442 14.7481 12.6213 11.2942 16.0418 15.0133 10.1607 14.1507 4.0830 4.9710 12.0466 3.6990 11.4952 11.6165 1.2664 11.9743 9.6867 1.4884 6.5292 1.4285 10.1890 12.0327 3.4154 3.0911 13.5844 5.9130 1.5733 2.2347 6.0221 2.2876 2.6942 5.4533 12.0010 10.3044 4.2785 12.2576 12.0064 4.8257 12.0231 12.0293 12.7368 1.0918 1.0986 1.1101
irintensity: 0.2353 0.6496 1.8899 0.0364 0.6888 1.1795 0.2958 1.7414 3.2978 2.3309 0.0316 2.1457 1.3692 4.2192 2.0742 0.0049 1.6123 0.0985 1.4793 0.9876 0.3009 0.3601 0.0418 0.0160 32.0448 10.0303 47.4268 29.0261 66.8728 17.9550 36.4836 1.2733 4.4622 48.4833 100.6262 101.5731 6.6534 0.8957 38.5576 47.2128 55.8988 42.3260 31.0256 319.9017 99.6360 0.0472 168.5969 63.7275 281.4259 76.9850 11.7178 0.0433 36.8905 240.0664 1.9105 2.8299 3.1467
temp: 298.150 k
press: 1.00000 atm
elementType: 9 9 9 9 9 8 7 7 6 6 6 6 6 6 6 6 6 6 1 1 1
symmnumber: 1
zpe: 303473.9 jmol-1
zpe.correction: 0.115587 hartree
zpe.thermalcorrener: 0.129884 hartree
zpe.thermalcorrenthalpy: 0.130829 hartree
zpe.thermalcorrgfe: 0.073676 hartree
zpe.sumelectzpe: -1065.471547 hartree
zpe.sumelectthermal: -1065.457250 hartree
zpe.sumelectthermalent: -1065.456306 hartree
zpe.sumelectthermalfe: -1065.513458 hartree
dipole: 1.1977 -0.0186 -1.8374
dipole: 2.1934
quadrupole: -118.1642 -108.6695 -97.3627
quadrupole: 0.0161 2.4626 0.0588
quadrupole: -10.0987 -0.6040 10.7028 0.0161 2.4626 0.0588
hfenergy: -1065.5871342 hartree
pointgroup: C01 [X(C10H3F5N2O1)]
dipole: -0.4481036 0.0010673 -0.737496 debye
dipolederiv: -0.3151423 -0.3068939 -0.0626104 -0.218188 -0.7358152 -0.0906126 -0.0760153 -0.0940254 -0.1144664 -0.3133308 0.3058459 -0.0637175 0.2163394 -0.7368622 0.09333 -0.0767046 0.0968568 -0.1152779 -0.4013471 -0.3338842 -0.0739591 -0.424981 -0.7347858 -0.0955915 -0.1047162 -0.1088161 -0.0990199 -0.3995891 0.3322211 -0.0752184 0.4236307 -0.7348643 0.0984587 -0.1063856 0.1116703 -0.099906 -0.9777498 0.0000237 -0.2325152 0.0002618 -0.1514954 0.0002553 -0.280321 0.0002149 -0.1478738 -0.7174593 0.0000343 -0.0877015 -0.0003324 -0.2668893 0.0004739 0.3304148 0.0037492 -1.0152246 -1.4637869 -0.0044909 0.7745508 -0.0072818 0.0047713 0.0050532 0.6541528 0.0031721 -0.7396545 -0.4305518 -0.000952 0.0900276 -0.0009691 -0.2487598 0.0010227 0.4315372 0.0017344 -0.5450413 -0.3952524 -0.000296 -0.0650104 0.0021204 -0.1986048 0.0008865 -0.050286 0.0002254 -0.1272048 2.0155673 0.0036688 -0.4067201 0.0040288 0.2222481 -0.0040687 -0.7269161 -0.0052306 1.5551074 0.3616818 0.4308471 0.0799324 0.1294858 0.8394111 0.0872234 0.0995723 0.1372996 0.1172353 0.3607894 -0.4301978 0.0817551 -0.1281391 0.841285 -0.0907494 0.0978127 -0.1408066 0.118276 0.2950402 0.521377 0.045713 0.5317064 0.7534201 0.1301919 0.0701388 0.1642491 0.087425 0.2929744 -0.5193559 0.0477695 -0.5300922 0.7538287 -0.1330713 0.0721647 -0.167009 0.0886326 1.1074472 -0.0001375 0.2786626 -0.0003204 0.1312003 -0.0001339 0.309703 -0.0001741 0.1695259 -0.0041539 0.0001209 -0.135526 0.0012813 -0.1327474 -0.0016121 -0.468416 -0.0025819 0.2879265 0.9407534 0.0029085 -0.3550275 0.0008771 -0.0408326 -0.0018916 -0.0373471 -0.0001573 0.0875082 -0.2074187 -0.0008954 0.15345 -0.0001883 -0.1344647 -0.0009804 -0.0960794 -0.0015518 0.3249026 0.0248807 0.0003517 -0.0619294 0.0002489 0.1901016 0.0004297 -0.0534466 0.0002226 0.1079281 0.1223043 -0.0002244 0.0253546 0.0003736 0.1897969 0.0009513 0.0019534 0.0003254 0.0690878 0.1043434 -0.0000707 0.0427199 0.0001383 0.1900584 0.000435 0.009184 0.000633 -0.0098861 unknown
polarizability: 168.9723217|0.1745722|102.3042714|4.3907952|-0.261045|99.6092242 unknown
InChI: InChI=1S/C10H3F5N2O/c11-5-4(10(18)17-2-1-16-3-17)6(12)8(14)9(15)7(5)13/h1-3H
charge 0 multiplicity 1
21 atoms
F  -0.15677 2.411582 0.455244
F  -0.162401 -2.421084 0.466504
F  -2.8201 -2.42435 -0.379864
F  -2.81463 2.417072 -0.390886
F  -4.147436 -0.003086 -0.799614
O  1.468911 -0.005886 2.303741
N  2.339996 0.001861 0.136041
N  4.483551 0.006071 -0.617014
C  -0.121668 -0.004751 0.47473
C  1.277406 -0.005691 1.06904
C  -0.81399 1.201482 0.252117
C  -0.816771 -1.210481 0.257841
C  -2.158332 -1.225442 -0.168892
C  -2.155571 1.217615 -0.174506
C  -2.828232 -0.00363 -0.382146
C  2.271586 0.008466 -1.283726
C  3.719489 0.004225 0.474381
C  3.585067 0.009334 -1.718684
H  1.328963 0.010875 -1.822293
H  4.054117 0.001322 1.5079
H  3.957216 0.012197 -2.740112
