program: Gaussian 09
title: 000100821
version: EM64L-G09RevD.01
frameworkgroup: C1[X(C6H3F5N2O)]
method: RPBEPBE
basis: SDD
operation: Freq
keyword: #p
keyword: freq=noraman
keyword: PBEPBE/SDD
title: #p freq=noraman PBEPBE/SDD
converged: NO NO NO NO
title: Mulliken charges:
elementType: F F F F F O N N C C C C C C H H H
charge: -0.146500 -0.146386 -0.128224 -0.127681 -0.129229 -0.156215 -0.204762 -0.067022 0.131514 0.277944 0.376881 -0.085898 -0.140298 -0.311190 0.291253 0.297076 0.268737
chargesum: 0.00000
title: Mulliken charges with hydrogens summed into heavy atoms:
elementType: F F F F F O N N C C C C C C
charge: -0.146500 -0.146386 -0.128224 -0.127681 -0.129229 -0.156215 -0.204762 -0.067022 0.131514 0.277944 0.376881 0.205355 0.156778 -0.042452
polarizability: 1.08622872e+02 -8.23365302e+00 8.39492229e+01 -5.39511047e-04 1.66344614e-03 4.84862834e+01
1716.lowfreq: -0.0007 0.0006 0.0009 8.8183 9.7502 14.1990 40.5328 61.9086 82.6126
frequency: 40.2798 61.8532 82.5989 104.6435 162.9305 180.0301 199.5333 240.1990 265.8522 278.7059 312.6073 359.8828 367.4763 458.7597 511.0903 514.1740 588.9480 615.8658 633.0398 650.1384 717.7250 729.7769 788.4505 808.9394 861.3555 872.5118 957.3806 992.2641 998.1826 1040.3414 1051.6136 1070.2180 1086.6516 1119.5729 1187.3489 1223.7244 1232.1395 1280.5647 1362.2163 1446.0716 1503.6939 1640.0272 3240.0799 3258.3335 3279.3358
redmass: 13.7872 4.6729 15.5523 10.6005 7.1912 10.0329 17.3767 13.6083 16.1995 7.4957 18.2120 15.1457 17.3397 17.1031 16.9678 10.5342 3.1632 12.8894 3.5052 16.4159 5.5818 1.3740 10.8445 1.4658 6.6467 1.4237 5.9993 12.3265 3.6820 5.3272 8.8747 13.1514 4.5371 1.6266 3.9980 6.1188 1.6750 2.2209 4.8421 4.3882 4.7349 12.7716 1.0941 1.0990 1.1083
irintensity: 0.0005 2.0358 0.6262 1.1046 3.9528 0.5423 3.9349 0.0508 7.9429 7.3152 0.1121 2.2381 2.5654 4.7932 0.9785 2.5688 2.7772 33.7504 17.1769 30.2569 7.0781 42.2953 139.2124 47.0801 0.2832 3.8740 3.0288 91.3434 191.8421 131.5734 106.0453 269.0459 42.6025 22.8626 16.3637 2.5509 56.0273 170.4989 86.8521 77.7982 14.1770 258.7106 4.4440 8.0061 2.8510
temp: 298.150 k
press: 1.00000 atm
elementType: 9 9 9 9 9 8 7 7 6 6 6 6 6 6 1 1 1
symmnumber: 1
zpe: 241508.9 jmol-1
zpe.correction: 0.091986 hartree
zpe.thermalcorrener: 0.104371 hartree
zpe.thermalcorrenthalpy: 0.105315 hartree
zpe.thermalcorrgfe: 0.052251 hartree
zpe.sumelectzpe: -913.303944 hartree
zpe.sumelectthermal: -913.291558 hartree
zpe.sumelectthermalent: -913.290614 hartree
zpe.sumelectthermalfe: -913.343678 hartree
dipole: 0.7607 -1.7169 -0.0001
dipole: 1.8779
quadrupole: -88.7051 -77.3324 -79.7380
quadrupole: -4.4023 -0.0093 -0.0023
quadrupole: -6.7800 4.5928 2.1872 -4.4023 -0.0093 -0.0023
hfenergy: -913.3959296 hartree
pointgroup: C01 [X(C6H3F5N2O1)]
dipole: -0.2959242 -0.6769495 -0.0011379 debye
dipolederiv: -0.3976178 0.0076992 -0.050798 0.0559298 -0.384544 -0.243752 0.0218753 -0.1599164 -0.5503203 -0.39737 0.007377 0.0506501 0.0559041 -0.3867731 0.2448298 -0.0216933 0.160912 -0.5481985 -0.4023027 -0.0883541 -0.1135326 -0.0269612 -0.3854677 -0.2304234 -0.0304998 -0.2142608 -0.6078182 -0.4022047 -0.0893384 0.1136454 -0.027525 -0.3874615 0.2316076 0.0309317 0.215254 -0.6054798 -0.6574288 0.2785202 0.0004564 0.2344213 -0.5645765 -0.0006223 0.0002786 -0.0004766 -0.2654295 -0.7261786 -0.0771556 -0.0003771 -0.6162344 -0.7479102 -0.0012119 -0.0003644 -0.0002346 -0.2439469 -1.7424905 -0.4288558 -0.0011886 -0.1048874 -0.3156158 -0.0004151 -0.0011332 -0.0006745 0.0077209 -0.576687 -0.1069955 -0.000249 -0.4168886 -0.3516734 -0.0003207 -0.0008648 -0.0002654 -0.2436317 0.7310689 0.0178397 0.0002558 -0.0532951 0.6355335 -0.0013325 0.0004474 -0.0014016 1.1456647 1.7350165 0.4303988 0.0009929 0.6071088 0.9463082 0.0014841 0.0004363 0.0009271 0.1519772 1.4924515 -0.1388161 -0.0006767 -0.0945393 1.3373361 -0.000494 -0.000561 -0.0004859 1.4611193 0.2858809 0.1599896 0.0004073 0.430086 0.0738615 0.0005312 0.0008138 0.0003904 -0.1226363 0.9331547 0.0355528 0.0005103 -0.3137601 0.0096549 0.000008 0.000071 0.0001189 -0.0494426 -0.1472695 0.0532581 0.0002128 0.305578 0.2894415 0.0007946 0.0004691 0.0007464 -0.1320336 0.1021867 0.0530502 0.0000186 0.0182206 0.1033996 -0.0001921 -0.0000086 -0.0001572 0.2117836 0.0944479 -0.0377426 -0.0001293 -0.015559 0.0933955 -0.0001936 -0.0000735 -0.0001711 0.1975895 0.0753425 -0.0764274 -0.0001982 -0.0375984 0.0350915 -0.0002977 -0.0001245 -0.0003047 0.1930823 unknown
polarizability: 108.5405911|8.3555584|84.0313993|0.0383776|0.0579737|48.4863884 unknown
InChI: InChI=1S/C6H3F5N2O/c7-5(8,6(9,10)11)4(14)13-2-1-12-3-13/h1-3H
charge 0 multiplicity 1
17 atoms
F  0.776206 -1.26849 -1.149049
F  0.776009 -1.274664 1.143558
F  2.657162 0.857994 1.14491
F  2.658986 0.863334 -1.137269
F  3.290999 -0.994091 -0.000328
O  0.152111 1.881676 0.002381
N  -1.496108 0.215944 0.000513
N  -3.761793 0.413988 -0.000664
C  0.927195 -0.438344 -0.00036
C  -0.16386 0.674315 0.001899
C  2.402868 0.092882 0.001339
C  -2.021482 -1.110307 -0.002192
C  -2.619864 1.095787 0.001264
C  -3.395542 -0.961509 -0.002714
H  -1.390007 -1.991992 -0.00339
H  -2.499954 2.175612 0.003137
H  -4.153526 -1.741036 -0.004536
