program: Gaussian 09
title: 000100818
version: EM64L-G09RevD.01
frameworkgroup: C1[X(C4H4N2O2S)]
method: RPBEPBE
basis: SDD
operation: Freq
keyword: #p
keyword: freq=noraman
keyword: PBEPBE/SDD
title: #p freq=noraman PBEPBE/SDD
converged: NO NO NO NO
title: Mulliken charges:
elementType: S O O N N C C C C H H H H
charge: 0.361968 -0.287961 -0.232308 0.094040 -0.639104 0.452125 -0.261518 -0.223254 -0.485270 0.256246 0.276039 0.369861 0.319137
chargesum: 0.00000
title: Mulliken charges with hydrogens summed into heavy atoms:
elementType: S O O N N C C C C
charge: 0.361968 -0.287961 -0.232308 0.094040 0.049895 0.452125 -0.261518 0.032992 -0.209232
polarizability: 1.10518322e+02 5.24904231e+00 1.09650486e+02 -9.32937902e-03 1.08347416e-02 3.06562498e+01
1716.lowfreq: -8.2039 -6.8117 -0.0033 -0.0032 -0.0011 10.2733 113.8298 154.6573 214.5548
frequency: 113.8276 154.6523 214.5543 244.7086 331.5045 404.7224 425.5587 457.1339 472.4181 565.8108 626.5832 646.3729 670.0372 719.9781 731.4781 749.9362 778.8054 876.1979 979.6714 1042.2487 1095.9090 1140.2497 1236.6554 1286.7209 1328.2167 1461.2103 1474.6214 1552.1633 1615.9363 3177.3433 3234.4241 3405.0040 3654.2815
redmass: 11.3592 6.3594 10.2620 5.8278 4.1921 8.6269 3.8786 1.2166 10.4647 6.0693 2.6765 8.1722 5.2766 11.0069 1.1459 1.7699 5.3987 1.3204 2.1913 10.0862 1.1475 2.2485 4.2027 1.7934 9.7670 5.7179 5.5694 1.4910 3.2838 1.0928 1.0997 1.0548 1.0952
irintensity: 0.4135 0.0139 3.7351 8.6927 5.5900 2.1800 9.0635 127.5474 0.2096 0.4180 60.1379 13.6350 8.9962 5.0002 83.1322 113.8089 8.9661 2.2425 3.5587 57.0233 27.6304 10.4428 124.7655 12.4516 258.3036 118.5068 12.8009 14.5388 336.4468 3.3075 0.3493 57.9493 76.5488
temp: 298.150 k
press: 1.00000 atm
elementType: 16 8 8 7 7 6 6 6 6 1 1 1 1
symmnumber: 1
zpe: 220525.2 jmol-1
zpe.correction: 0.083994 hartree
zpe.thermalcorrener: 0.091880 hartree
zpe.thermalcorrenthalpy: 0.092825 hartree
zpe.thermalcorrgfe: 0.051264 hartree
zpe.sumelectzpe: -812.084887 hartree
zpe.sumelectthermal: -812.077000 hartree
zpe.sumelectthermalent: -812.076056 hartree
zpe.sumelectthermalfe: -812.117617 hartree
dipole: 5.7269 4.1145 -0.0008
dipole: 7.0517
quadrupole: -61.6839 -50.4127 -61.2566
quadrupole: -2.2807 0.0016 -0.0002
quadrupole: -3.8995 7.3717 -3.4722 -2.2807 0.0016 -0.0002
hfenergy: -812.1688804 hartree
pointgroup: C01 [X(C4H4N2O2S1)]
dipole: 2.5791571 1.0222431 -0.0003314 debye
dipolederiv: -0.0929422 -0.2130898 -0.0000154 -0.1277882 -0.1613993 -0.0000461 -0.0000419 -0.000089 0.1953795 -0.6921424 0.1793117 0.0000593 0.4413665 -0.6831723 -0.0001648 0.0002001 -0.0001846 -0.2910207 -0.7490578 -0.2407836 -0.0000361 -0.3740775 -0.7252417 -0.0001306 0.0000075 -0.0000718 -0.2466362 1.8731348 0.2218588 -0.0001091 0.0141797 0.972828 0.0003009 -0.0002204 0.0002568 0.2235542 -0.1792147 0.2589229 0.0000193 -0.2033169 -1.246034 -0.0000335 -0.0000456 -0.0000967 -0.624008 0.4381077 -0.4396004 -0.0000761 0.3849245 1.1208258 0.0000073 0.0000797 0.00006 0.1950404 -1.0585007 -0.4806209 0.0000351 -0.338906 0.067121 0.0000704 -0.0000351 0.0001029 -0.1906115 -0.0269566 0.3899088 0.0000335 0.0483751 -0.4687868 -0.0000407 -0.000001 -0.0000384 -0.1861426 0.0803708 0.311982 0.0000569 0.2833909 0.4488309 0.0000879 0.0000431 0.0000988 -0.2532849 0.0140724 -0.0450254 0.0000009 -0.1085654 0.0179116 -0.0000203 -0.0000062 -0.0000166 0.2055654 0.0274526 0.0412196 0.000009 0.0223148 0.0918938 -0.0000177 0.0000082 -0.0000169 0.2048969 0.195509 0.0081003 0.0000202 -0.0497759 0.2876021 -0.0000092 0.0000023 -0.000027 0.3814971 0.1701672 0.0078162 0.0000027 0.0078784 0.277621 -0.0000037 0.0000092 0.0000225 0.3857704 unknown
polarizability: 112.9433301|4.423491|107.2254782|-0.0064145|0.0127782|30.6562498 unknown
InChI: InChI=1S/C4H4N2O2S/c5-3-1-2-9-4(3)6(7)8/h1-2H,5H2
charge 0 multiplicity 1
13 atoms
S  0.636196 -1.852876 -0.000367
O  -2.093716 1.090242 0.000645
O  -2.28612 -1.208434 -0.000073
N  -1.570546 -0.123729 0.000088
N  0.393421 2.170402 0.000185
C  0.755958 0.850698 0.000049
C  -0.16679 -0.226138 -0.00003
C  2.123563 0.366354 -0.000052
C  2.219237 -1.011143 -0.000262
H  2.991112 1.030735 0.00001
H  3.127342 -1.61212 -0.00037
H  -0.615439 2.369394 0.00017
H  1.09268 2.908316 0.000206
