program: Gaussian 09
title: 000100826
version: EM64L-G09RevD.01
frameworkgroup: C1[X(C9H19N3O)]
method: RPBEPBE
basis: SDD
operation: Freq
keyword: #p
keyword: freq=noraman
keyword: PBEPBE/SDD
title: #p freq=noraman PBEPBE/SDD
converged: YES YES NO NO
title: Mulliken charges:
elementType: O N N N C C C C C C C C C H H H H H H H H H H H H H H H H H H H
charge: -0.251866 -0.059510 -0.298794 -0.381891 -0.318100 -0.323217 -0.428027 -0.418867 -0.464828 0.208771 -0.017054 -0.667037 -0.708045 0.180732 0.228356 0.200752 0.184374 0.203116 0.205058 0.204023 0.195767 0.239057 0.170686 0.266525 0.246021 0.288679 0.209769 0.196439 0.252164 0.232171 0.224247 0.200529
chargesum: 0.00000
title: Mulliken charges with hydrogens summed into heavy atoms:
elementType: O N N N C C C C C C C C C
charge: -0.251866 -0.059510 -0.032269 -0.093212 0.090988 0.061909 -0.019853 -0.019076 -0.055085 0.208771 0.228967 -0.008666 -0.051098
polarizability: 1.52369643e+02 1.58401350e+00 1.12630538e+02 -5.71048138e+00 3.08145985e+00 9.97431353e+01
1716.lowfreq: -12.7243 -2.2807 -0.0004 0.0002 0.0006 11.5129 27.3584 39.2124 50.8591
frequency: 23.3250 37.9993 50.8204 62.7875 127.1755 143.4641 199.8906 208.7424 234.9131 250.9967 259.5201 289.6540 322.5575 366.1852 386.1115 399.1647 451.7481 461.3415 471.8491 531.0807 557.2890 602.0873 694.5756 711.3124 775.3774 837.2756 849.8993 882.8550 896.4554 918.9808 927.6929 946.9453 958.5772 991.0975 1026.6905 1055.3654 1065.6901 1099.8821 1130.7528 1140.8160 1143.4262 1162.8094 1165.2084 1179.9686 1198.0642 1203.1523 1215.3774 1269.9508 1284.9223 1308.7957 1309.0512 1320.8323 1333.1664 1351.6481 1360.3060 1376.2072 1383.8605 1391.1976 1393.5658 1439.5858 1443.0369 1450.4920 1456.0643 1456.8750 1463.9444 1465.6028 1467.7376 1469.7262 1484.0437 1486.1105 1622.9041 2776.4262 2847.3934 2858.9277 2885.5452 2896.1358 2973.6801 2979.7985 2996.9249 3021.1775 3022.8305 3037.2426 3041.0378 3052.3675 3067.0630 3078.8534 3090.4443 3095.8466 3453.8562 3524.8286
redmass: 3.6557 3.3920 3.5169 3.5685 3.5963 3.3812 2.3374 1.1020 2.8334 1.2376 1.9239 2.1062 3.3942 2.8997 1.9348 2.8040 2.6266 2.8946 2.4215 1.4123 1.7352 2.7011 1.6664 5.0099 3.8730 2.4876 1.5139 2.8598 2.7241 1.2276 2.2095 1.5374 2.1901 2.0833 2.3247 1.6998 1.8101 2.1545 2.2552 2.1288 2.0511 3.2765 2.4137 2.1117 1.2353 1.3779 1.3670 1.3292 1.4698 1.5223 1.3532 1.2407 1.3349 1.2562 1.4296 1.2154 1.3968 1.5095 1.2336 1.1008 1.3512 1.0949 1.0877 1.3297 1.1018 1.1429 1.0669 1.1262 1.1983 1.0527 7.2136 1.0709 1.0704 1.0693 1.0695 1.0686 1.0378 1.0362 1.0836 1.0896 1.0847 1.0897 1.0922 1.0885 1.0979 1.0987 1.0999 1.1000 1.0752 1.0772
irintensity: 1.8404 3.0351 2.2712 2.5463 7.6619 1.2199 1.6659 0.3029 1.1409 1.1523 3.5670 7.8966 4.1194 6.8497 0.2751 7.4677 15.8208 1.0722 21.3651 77.0772 75.0306 2.0587 71.2606 10.7660 8.7225 1.9724 0.3394 1.4811 3.0622 1.9515 2.2362 0.5366 22.9675 13.0552 10.4377 0.3900 11.3169 7.3974 26.1671 15.0187 4.2574 27.7885 32.1118 40.1128 31.1784 43.7182 26.4361 7.7496 14.6007 16.4642 6.4680 36.4241 13.5265 3.6171 3.8513 24.2010 2.1908 3.6597 31.7619 29.2497 2.9827 1.4844 11.2813 133.2059 22.0511 54.4661 9.6234 4.3253 52.5075 18.2962 140.0069 130.8061 71.0630 97.5583 91.7792 144.8891 26.5132 28.4685 17.4443 49.0176 1.3710 65.8666 42.2675 23.3312 12.2699 67.4065 29.5670 31.7129 2.3302 8.4663
temp: 298.150 k
press: 1.00000 atm
elementType: 8 7 7 7 6 6 6 6 6 6 6 6 6 1 1 1 1 1 1 1 1 1 1 1 1 1 1 1 1 1 1 1
symmnumber: 1
zpe: 736343.1 jmol-1
zpe.correction: 0.280458 hartree
zpe.thermalcorrener: 0.294958 hartree
zpe.thermalcorrenthalpy: 0.295902 hartree
zpe.thermalcorrgfe: 0.237807 hartree
zpe.sumelectzpe: -592.758141 hartree
zpe.sumelectthermal: -592.743641 hartree
zpe.sumelectthermalent: -592.742697 hartree
zpe.sumelectthermalfe: -592.800792 hartree
dipole: 1.0125 -1.2532 -2.8830
dipole: 3.3027
quadrupole: -65.5875 -75.8155 -87.8318
quadrupole: -2.2037 -6.7394 0.2002
quadrupole: 10.8241 0.5961 -11.4202 -2.2037 -6.7394 0.2002
hfenergy: -593.0385989 hartree
pointgroup: C01 [X(C9H19N3O1)]
dipole: 0.392326 0.4464242 1.1554898 debye
polarizability: 152.2785131|-1.9785941|112.3810895|6.0032058|3.5465611|100.0837135 unknown
InChI: InChI=1S/C9H19N3O/c1-8(2)11-9(13)7-12-5-3-10-4-6-12/h8,10-11H,3-7H2,1-2H3
charge 0 multiplicity 1
32 atoms
O  1.070252 -0.243882 -1.532496
N  -1.400516 0.459371 -0.100003
N  -3.975636 -0.688892 0.390281
N  2.24932 0.443674 0.348465
C  -1.524963 -0.916736 0.438703
C  -2.551715 1.310527 0.285553
C  -2.846293 -1.54974 -0.031739
C  -3.867835 0.668618 -0.189061
C  -0.113936 1.092208 0.201195
C  1.09548 0.351567 -0.415247
C  3.542596 -0.127868 -0.093352
C  3.649086 -1.621823 0.295906
C  4.702115 0.710689 0.479988
H  -1.502301 -0.920113 1.558994
H  -0.678514 -1.517645 0.062254
H  -2.432332 2.304229 -0.187248
H  -2.608119 1.454241 1.395434
H  -2.790074 -1.675415 -1.139906
H  -2.960042 -2.54811 0.429209
H  -4.721206 1.280722 0.156885
H  -3.865659 0.662751 -1.306537
H  -0.12403 2.114354 -0.228319
H  0.063016 1.211773 1.307471
H  -4.890568 -1.122411 0.21244
H  3.539088 -0.060434 -1.197157
H  2.198646 0.866503 1.278454
H  4.589309 -2.056213 -0.090966
H  3.636912 -1.746405 1.395131
H  2.804456 -2.185966 -0.134767
H  4.625668 1.766425 0.164182
H  5.670217 0.313463 0.127607
H  4.712077 0.675139 1.587343
