program: Gaussian 09
title: 000100791
version: EM64L-G09RevD.01
frameworkgroup: C1[X(C10H12N6)]
method: RPBEPBE
basis: SDD
operation: Freq
keyword: #pfreq=noraman
keyword: PBEPBE/SDD
title: #p freq=noraman PBEPBE/SDD
converged: YES YES NO NO
title: Mulliken charges:
elementType: N N N N N N C C C C C C C C C C H H H H H H H H H H H H
charge: -0.355240 -0.370755 -0.060247 -0.063425 0.012010 0.012902 -0.084041 -0.708601 0.217569 0.169137 -0.371647 -0.343269 -0.265316 -0.262145 -0.293994 -0.289699 0.233343 0.324262 0.324426 0.235358 0.247848 0.220239 0.240976 0.261395 0.238434 0.239700 0.245006 0.245774
chargesum: 0.00000
title: Mulliken charges with hydrogens summed into heavy atoms:
elementType: N N N N N N C C C C C C C C C C
charge: -0.030978 -0.046329 -0.060247 -0.063425 0.012010 0.012902 0.149303 -0.005156 0.217569 0.169137 -0.130671 -0.081874 -0.026881 -0.022445 -0.048989 -0.043925
polarizability: 2.12336257e+02 1.03982243e+01 1.38785254e+02 9.75208370e+00 4.39674311e-01 1.03901075e+02
1716.lowfreq: -4.3484 -0.0005 -0.0003 -0.0001 0.9948 7.3003 24.5919 44.1655 48.0117
frequency: 24.5078 44.0559 47.9979 79.2491 122.5898 135.1338 182.9912 191.3869 238.2787 287.1114 296.7055 401.8247 416.3761 420.0459 452.8131 484.9671 505.2528 519.7053 554.1975 562.2616 591.0250 600.5863 650.2786 667.5054 751.3569 753.4276 822.3134 827.2291 831.1040 836.7186 881.5145 889.4541 908.2743 942.6606 943.1936 955.5900 958.9038 978.3777 1036.8686 1042.3657 1093.2169 1120.9934 1148.9324 1159.1126 1180.5068 1233.8515 1246.2937 1281.0097 1285.2310 1322.0865 1329.4803 1336.9996 1366.5797 1390.1032 1400.2931 1402.3400 1416.5686 1424.5611 1467.3420 1475.2308 1483.9947 1491.8292 1502.9435 1516.3912 1544.6188 1562.2130 2954.3988 2990.4789 3089.9451 3104.6666 3132.0831 3136.9290 3138.3312 3149.8293 3169.6955 3169.8019 3529.5301 3535.9094
redmass: 5.8920 5.2964 5.7375 3.9102 4.2900 4.2702 3.8831 3.9367 1.1118 5.0188 3.4788 3.7707 4.3034 4.8282 3.6706 1.5391 2.3621 2.4618 2.3254 1.8372 7.5987 7.3408 5.5669 5.7122 2.4581 2.5396 1.7811 1.8015 3.0950 3.3994 1.4025 1.4333 2.5928 1.4059 1.4008 5.2772 5.3055 1.9719 2.6923 2.4130 2.5885 3.1886 2.3393 2.1972 2.1138 2.3443 3.5022 2.7949 2.4765 1.3240 1.3165 1.3419 1.3052 1.2313 1.8751 1.9602 1.6195 1.7080 1.1779 1.0643 2.3094 4.3644 4.7141 3.1003 5.8950 6.1124 1.0843 1.0362 1.1007 1.0996 1.0913 1.0888 1.0891 1.0913 1.0989 1.0985 1.0767 1.0768
irintensity: 0.0852 0.3168 0.6559 3.3259 0.3212 0.9985 0.3562 0.8641 0.4106 2.7402 1.1702 8.8846 7.4369 4.0325 20.7089 44.7437 36.2461 8.7500 54.1082 105.0116 6.8937 4.9342 2.2784 6.4585 2.5340 3.3238 49.3356 41.1978 5.8096 7.6840 0.1069 0.1830 1.7548 0.4398 0.3733 13.8033 13.3640 2.6905 9.3532 6.8238 2.7310 66.7628 95.5505 12.8082 76.9107 8.9328 14.8089 21.0000 22.5376 39.5888 17.6428 70.0754 3.5258 27.3760 153.4627 22.9861 19.8682 34.8922 86.1034 15.4934 301.0150 34.6123 72.1287 61.2533 375.6875 230.4671 19.5146 17.4659 22.9354 27.7848 45.2816 5.5435 10.0297 30.9180 39.5973 16.7604 46.6451 34.7413
temp: 298.150 k
press: 1.00000 atm
elementType: 7 7 7 7 7 7 6 6 6 6 6 6 6 6 6 6 1 1 1 1 1 1 1 1 1 1 1 1
symmnumber: 1
zpe: 574928.4 jmol-1
zpe.correction: 0.218979 hartree
zpe.thermalcorrener: 0.233012 hartree
zpe.thermalcorrenthalpy: 0.233957 hartree
zpe.thermalcorrgfe: 0.176266 hartree
zpe.sumelectzpe: -715.591808 hartree
zpe.sumelectthermal: -715.577774 hartree
zpe.sumelectthermalent: -715.576830 hartree
zpe.sumelectthermalfe: -715.634520 hartree
dipole: 0.8398 3.0534 0.8942
dipole: 3.2906
quadrupole: -93.5529 -91.1301 -99.3969
quadrupole: 1.8602 -3.8561 -3.2170
quadrupole: 1.1404 3.5632 -4.7036 1.8602 -3.8561 -3.2170
hfenergy: -715.8107868 hartree
pointgroup: C01 [X(C10H12N6)]
dipole: -0.3161874 1.2201787 -0.2953645 debye
polarizability: 211.7446572|-11.3984415|138.8808135|11.5257864|1.0795365|104.3971152 unknown
InChI: InChI=1S/C10H12N6/c1-8(15-9-6-11-2-4-13-9)16-10-7-12-3-5-14-10/h2-8,15-16H,1H3
charge 0 multiplicity 1
28 atoms
N  0.834692 0.717128 -0.598755
N  -1.397972 1.485454 -0.164774
N  2.658396 -0.565029 -1.291426
N  -3.55148 0.646322 -0.491517
N  3.770657 -0.500846 1.329887
N  -2.767776 -1.90859 0.491324
C  -0.022708 1.499928 0.319616
C  0.4537 2.961816 0.467068
C  2.030067 0.109367 -0.267429
C  -2.263455 0.403096 -0.081023
C  2.613129 0.148344 1.044789
C  -1.873719 -0.890897 0.396999
C  3.821818 -1.201129 -0.987961
C  -4.431536 -0.389228 -0.401494
C  4.378592 -1.186106 0.312946
C  -4.05475 -1.65793 0.096407
H  0.022824 1.004804 1.313008
H  0.550169 0.650304 -1.579799
H  -1.817741 2.355733 -0.499784
H  -0.150503 3.497816 1.220467
H  1.509457 2.986711 0.783743
H  0.379204 3.491428 -0.500367
H  2.158149 0.707275 1.868951
H  -0.842215 -1.11525 0.683315
H  4.313395 -1.731445 -1.810667
H  -5.454756 -0.188129 -0.735756
H  5.309063 -1.708658 0.55026
H  -4.769002 -2.48179 0.177572
