program: Gaussian 09
title: 000100907
version: EM64L-G09RevD.01
frameworkgroup: C1[X(C18Br14O2)]
method: RPBEPBE
basis: SDD
operation: Freq
keyword: #p
keyword: freq=noraman
keyword: PBEPBE/SDD
title: #p freq=noraman PBEPBE/SDD
converged: YES YES NO NO
title: Mulliken charges:
elementType: Br Br Br Br Br Br Br Br Br Br Br Br Br Br O O C C C C C C C C C C C C C C C C C C
charge: 0.157195 0.143631 0.143626 0.157182 0.141322 0.141317 0.172869 0.172885 0.144021 0.144017 0.138671 0.138670 0.140110 0.140109 -0.277092 -0.277073 0.577736 0.577747 -0.384798 -0.350157 -0.350182 -0.384814 0.580432 0.580438 -0.382209 -0.382234 -0.334553 -0.334541 -0.126682 -0.126692 -0.133308 -0.133305 -0.207168 -0.207171
chargesum: 0.00000
title: Mulliken charges with hydrogens summed into heavy atoms:
polarizability: 6.84339387e+02 1.64081672e-01 4.53115107e+02 -4.68177398e+01 -9.25133597e-03 3.11852135e+02
1716.lowfreq: -2.4488 -0.0001 0.0002 0.0002 1.2451 2.0841 7.1538 11.4494 11.8953
frequency: 7.1358 11.4484 11.8916 18.7800 20.2251 23.5069 35.9532 38.1531 39.3670 39.5883 42.9154 47.2380 51.2880 52.4294 57.8821 74.4780 90.9228 130.3297 134.8654 137.0975 138.4184 138.8522 140.3640 141.9680 143.4773 150.5155 151.2347 155.4046 159.7709 172.9722 176.4866 199.3349 200.2824 202.5387 211.6284 211.6518 215.6608 224.5510 224.8028 255.8115 261.7374 301.8423 306.3978 308.1523 308.2415 322.1410 348.1643 370.6785 394.0272 438.6307 460.3909 526.8793 527.1906 562.3895 573.7882 575.4815 576.0200 588.3714 593.7289 594.3146 594.6807 611.9821 647.5255 654.2795 692.3041 719.0259 733.6908 738.1897 762.6226 763.2728 769.2772 773.6021 844.0161 910.3974 954.5451 1023.9716 1030.7930 1072.0418 1171.9763 1183.2937 1253.3698 1277.9343 1283.7112 1298.5752 1309.4269 1311.9956 1318.1010 1321.8149 1332.6170 1342.1890 1489.3733 1490.5267 1497.9791 1503.0491 1505.9933 1532.3658
redmass: 55.5899 67.4078 58.4077 59.3569 65.7703 55.2188 72.4953 73.5190 71.5604 66.3077 73.8912 61.8467 62.7942 67.2349 58.5094 60.5878 66.6390 52.9277 53.5850 67.7118 60.1109 62.9799 55.1239 62.4573 46.9671 66.8454 76.2097 17.6424 15.4517 29.4161 16.1164 56.0269 60.5551 47.3790 66.7834 66.9611 56.2816 68.1843 69.6962 16.5846 16.8991 14.0875 13.0076 12.3261 12.4244 13.5900 13.0434 16.2732 14.3061 13.7447 14.2034 13.7277 13.6960 13.6395 12.0420 12.0722 12.0459 12.7707 12.5089 12.0880 12.2226 12.1924 12.9418 13.0705 12.6774 12.0172 12.2791 12.1921 12.3768 12.3802 12.3947 12.8837 12.4869 12.8575 12.7601 12.1941 12.3826 12.5393 12.1559 12.3667 12.5183 12.0308 12.0234 12.0868 12.0585 12.0174 12.1480 12.3213 12.0404 12.1662 12.0053 12.0058 12.0008 12.0010 12.0088 12.0007
irintensity: 0.0002 0.0034 0.0250 0.0000 0.0057 0.1366 0.0054 0.0281 0.0013 0.0420 0.0076 0.0444 0.1512 0.0037 0.1404 0.0421 0.0026 0.0116 0.0409 0.1271 0.5114 0.0768 0.4096 0.2707 0.0640 0.0028 0.0281 1.5872 0.0825 1.4047 0.3356 0.0005 0.2086 0.0211 0.0348 0.0193 0.0061 0.6549 0.0411 0.5227 15.8733 1.1614 2.0170 0.0291 0.8800 0.0087 11.8464 5.4608 3.1844 7.3189 0.9381 21.5241 36.4953 28.7838 0.1360 2.1057 0.2780 45.9344 19.9132 0.1262 0.2500 2.0794 0.2893 24.0728 26.3010 3.4851 8.8455 16.7499 0.6078 0.3325 0.0309 55.3395 0.0004 195.8648 17.6582 32.6022 0.2174 65.7083 6.6013 2.6874 0.4438 15.9795 237.2575 494.6383 9.7118 145.0805 526.1490 134.4644 37.7092 627.2714 4.1673 1.3767 0.0261 23.9916 0.2746 6.4419
temp: 298.150 k
press: 1.00000 atm
elementType: 35 35 35 35 35 35 35 35 35 35 35 35 35 35 8 8 6 6 6 6 6 6 6 6 6 6 6 6 6 6 6 6 6 6
symmnumber: 1
zpe: 313064.5 jmol-1
zpe.correction: 0.119240 hartree
zpe.thermalcorrener: 0.158018 hartree
zpe.thermalcorrenthalpy: 0.158962 hartree
zpe.thermalcorrgfe: 0.033329 hartree
zpe.sumelectzpe: -1022.287472 hartree
zpe.sumelectthermal: -1022.248695 hartree
zpe.sumelectthermalent: -1022.247750 hartree
zpe.sumelectthermalfe: -1022.373383 hartree
dipole: 0.0000 0.5672 -0.0001
dipole: 0.5672
quadrupole: -313.4958 -314.3351 -320.3344
quadrupole: -0.0010 -5.5189 0.0009
quadrupole: 2.5593 1.7200 -4.2793 -0.0010 -5.5189 0.0009
hfenergy: -1022.4067122 hartree
pointgroup: C01 [X(C18Br14O2)]
dipole: -0.0000051 -0.2231539 0.0000148 debye
polarizability: 683.5169561|-0.174597|453.1151165|49.9756388|0.0015836|312.6745558 unknown
InChI: InChI=1S/C18Br14O2/c19-1-3(21)7(25)15(8(26)4(1)22)33-17-11(29)13(31)18(14(32)12(17)30)34-16-9(27)5(23)2(20)6(24)10(16)28
charge 0 multiplicity 1
34 atoms
Br -2.498854 1.206111 -2.236968
Br 0.765194 1.029103 -3.260341
Br -0.765187 1.030434 3.260235
Br 2.498834 1.20699 2.236808
Br 4.947738 2.898599 -0.661751
Br -4.947824 2.898973 0.661462
Br 2.051973 -2.073147 -0.812483
Br -2.051891 -2.072644 0.812575
Br 4.825616 -3.766744 0.113581
Br -4.825567 -3.766451 -0.11322
Br -7.831031 1.236889 -0.067248
Br 7.830972 1.236665 0.067182
Br -7.733407 -2.107115 -0.532854
Br 7.733424 -2.107296 0.533134
O  2.647408 1.065908 -0.965067
O  -2.647417 1.066324 0.964921
C  -1.347455 0.997217 0.434685
C  1.347452 0.997019 -0.434785
C  0.292058 1.031198 -1.384529
C  -1.053947 1.056388 -0.952977
C  1.053944 1.056735 0.95286
C  -0.292061 1.031737 1.384419
C  3.741974 0.282839 -0.563459
C  -3.741999 0.283223 0.563422
C  4.973539 0.978058 -0.42835
C  -4.973579 0.978407 0.428257
C  3.708071 -1.129889 -0.443433
C  -3.708062 -1.129512 0.443537
C  4.89011 -1.838565 -0.103411
C  -4.890093 -1.838254 0.103617
C  6.159335 0.270466 -0.118431
C  -6.159366 0.270752 0.118445
C  6.116957 -1.140293 0.065227
C  -6.116959 -1.140026 -0.065062
