program: Gaussian 09
title: 000100783
version: EM64L-G09RevD.01
frameworkgroup: C1[X(C14H14N4O)]
method: RPBEPBE
basis: SDD
operation: Freq
keyword: #p
keyword: freq=noraman
keyword: PBEPBE/SDD
title: #p freq=noraman PBEPBE/SDD
converged: NO YES NO NO
title: Mulliken charges:
elementType: O N N N N C C C C C C C C C C C C C C H H H H H H H H H H H H H H
charge: -0.247621 -0.242894 -0.072510 0.009069 -0.454013 -0.037920 0.003988 0.199994 0.156664 0.361570 -0.187606 -0.486536 0.447420 -0.339182 -0.494021 -0.845496 -0.802220 0.207073 -0.804248 0.279731 0.263727 0.232859 0.317544 0.228025 0.296316 0.228006 0.335524 0.235097 0.232014 0.235099 0.238144 0.270359 0.236042
chargesum: 0.00000
title: Mulliken charges with hydrogens summed into heavy atoms:
elementType: O N N N N C C C C C C C C C C C C C C
charge: -0.247621 -0.242894 -0.072510 0.009069 -0.118489 -0.037920 0.003988 0.199994 0.156664 0.361570 0.092125 -0.222808 0.447420 -0.106322 -0.176477 -0.093150 -0.100010 0.207073 -0.059703
polarizability: 3.67102824e+02 -5.53574327e+00 1.79318251e+02 9.03118229e-04 2.11816056e-02 8.48406646e+01
1716.lowfreq: -68.8902 -5.4799 -0.0008 -0.0005 0.0004 2.3145 11.5152 39.6423 52.9228
frequency: -68.8258 39.6381 52.9205 89.7197 100.4299 101.9055 111.0609 164.5376 177.4119 181.4003 225.7083 248.2528 260.3900 272.4198 300.4744 350.2055 354.5717 393.8195 449.5339 451.0895 512.9003 521.2413 536.9535 571.7245 579.3624 606.7362 612.5707 620.5849 659.9328 671.0123 686.5319 740.0124 749.2706 777.3891 785.3544 802.0407 869.9347 883.8473 913.3025 924.4506 930.2936 947.3018 953.3022 984.1901 1006.8103 1030.5207 1037.9756 1047.3404 1066.2648 1106.1310 1152.3612 1163.8635 1211.6646 1235.3692 1253.5929 1273.4366 1295.1943 1301.8296 1321.7954 1356.3829 1375.2161 1381.0180 1393.8459 1398.7670 1426.3590 1455.5748 1458.5606 1466.2560 1466.3426 1468.9685 1475.2327 1489.5903 1498.0854 1514.1470 1525.1495 1565.6231 1598.1985 1638.7054 1650.5020 2959.5791 2976.3304 2986.9647 3029.9579 3052.5401 3072.3441 3093.2768 3100.1937 3135.1703 3159.4814 3172.3299 3190.1087 3202.0375 3524.9922
redmass: 1.0716 5.0741 4.5514 1.9620 1.5390 4.7900 2.9764 2.1926 1.3263 3.9250 3.9939 5.8620 5.1715 3.3393 3.6052 4.9871 3.6857 3.9087 4.3790 3.7757 5.0194 5.7330 5.2175 6.6931 3.2427 2.7053 5.1374 1.6301 5.9972 2.8749 5.6848 5.5420 6.3066 7.1341 5.7312 1.4135 3.8398 1.3539 5.5603 3.1217 1.3737 1.3086 2.7878 1.5312 1.4983 1.6595 1.5121 1.5420 3.7810 2.7435 1.6740 3.0641 2.7037 4.0791 2.2059 3.5905 1.6749 2.3449 5.3335 5.7349 1.2444 4.0638 1.3112 1.2377 1.6986 1.1512 1.3647 1.0454 1.3008 1.0483 3.7472 1.0460 3.3074 2.7785 4.5825 5.5418 6.6176 5.2570 7.0188 1.0395 1.0377 1.0383 1.0977 1.0972 1.0984 1.0985 1.0954 1.0979 1.0888 1.0928 1.0990 1.0935 1.0757
irintensity: 0.0016 0.0019 14.4513 1.0891 0.0585 6.2684 1.3262 0.0104 0.2521 2.4668 0.0007 1.1693 1.4668 3.4373 0.1892 1.0864 1.7438 6.7299 5.5967 8.1416 4.9261 2.5150 2.4389 2.6671 3.5860 0.8157 19.8660 63.1211 0.4980 17.0528 2.5256 1.1203 1.0264 0.2180 1.9505 47.4498 1.7780 10.4481 2.2907 0.0596 25.7540 0.3094 35.9230 9.3796 5.6225 7.7709 1.7224 13.2085 0.6736 10.6443 4.0765 29.0423 1.1948 127.7110 100.4304 49.4029 34.8972 13.3480 86.3491 341.6084 69.0716 3.7159 31.6233 14.6916 172.3214 0.6682 10.1955 14.4613 19.7864 19.4395 3.0606 17.2570 206.3205 163.2866 12.9273 132.5124 45.0819 153.6480 92.0097 33.1898 39.6558 9.0848 19.4765 17.8572 15.2410 18.3429 1.7196 8.1430 5.4174 3.6592 3.9455 8.5046 17.1566
temp: 298.150 k
press: 1.00000 atm
elementType: 8 7 7 7 7 6 6 6 6 6 6 6 6 6 6 6 6 6 6 1 1 1 1 1 1 1 1 1 1 1 1 1 1
symmnumber: 1
zpe: 675457.7 jmol-1
zpe.correction: 0.257268 hartree
zpe.thermalcorrener: 0.273502 hartree
zpe.thermalcorrenthalpy: 0.274446 hartree
zpe.thermalcorrgfe: 0.213378 hartree
zpe.sumelectzpe: -834.812056 hartree
zpe.sumelectthermal: -834.795823 hartree
zpe.sumelectthermalent: -834.794878 hartree
zpe.sumelectthermalfe: -834.855946 hartree
dipole: 1.4847 3.0438 0.0078
dipole: 3.3866
quadrupole: -78.5077 -115.1264 -113.8756
quadrupole: -23.9183 -0.0302 -0.0041
quadrupole: 23.9955 -12.6231 -11.3724 -23.9183 -0.0302 -0.0041
hfenergy: -835.0693244 hartree
pointgroup: C01 [X(C14H14N4O1)]
dipole: -0.5958382 -1.1917263 0.0030822 debye
polarizability: 366.9761995|-7.3760728|179.4448745|-0.0011108|-0.0211717|84.8406646 unknown
InChI: InChI=1S/C14H14N4O/c1-8-4-5-18-12(6-8)17-13-9(2)11(16-10(3)19)7-15-14(13)18/h4-7,16H,1-3H3
charge 0 multiplicity 1
33 atoms
O  4.661019 1.710544 -0.001687
N  -1.797235 0.609411 -0.000654
N  -1.192751 -1.636747 -0.000729
N  0.458323 1.617703 -0.001418
N  3.629119 -0.403875 -0.002117
C  -0.05007 -0.822476 -0.001189
C  -0.389487 0.571845 -0.001135
C  -2.236411 -0.761979 -0.000391
C  1.321415 -1.175346 -0.001611
C  2.241422 -0.082936 -0.001848
C  -2.674916 1.678504 -0.000421
C  -3.643385 -0.998957 0.000175
C  -4.545141 0.06911 0.000441
C  -4.035647 1.424942 0.000129
C  1.779232 1.280275 -0.001766
C  1.742339 -2.629245 -0.001595
C  -6.043404 -0.153654 0.001045
C  4.739962 0.449168 -0.001146
C  6.077037 -0.295858 0.002185
H  -2.221706 2.672352 -0.000673
H  -3.981126 -2.038667 0.00039
H  -4.731952 2.268671 0.000321
H  2.505032 2.093682 -0.002089
H  2.339511 -2.891113 0.895001
H  0.842768 -3.264808 -0.001282
H  2.338993 -2.891291 -0.898483
H  3.841223 -1.404384 -0.002373
H  -6.513088 0.307481 0.890661
H  -6.296161 -1.226988 0.001249
H  -6.513791 0.307309 -0.888289
H  6.189316 -0.914159 0.912255
H  6.88885 0.44502 -0.022198
H  6.173412 -0.957532 -0.878658
