program: Gaussian 09
title: 000100788
version: EM64L-G09RevD.01
frameworkgroup: C1[X(C9H12N2O5S)]
method: RPBEPBE
basis: SDD
operation: Freq
keyword: #p
keyword: freq=noraman
keyword: PBEPBE/SDD
title: #p freq=noraman PBEPBE/SDD
converged: YES YES NO NO
title: Mulliken charges:
elementType: S O O O O O N N C C C C C C C C C H H H H H H H H H H H H
charge: 0.320233 -0.276408 -0.441453 -0.430175 -0.434818 -0.263412 -0.068013 -0.620481 -0.195569 -0.143511 -0.105672 -0.109555 -0.321135 -0.185232 0.281544 -0.631323 0.132675 0.253237 0.262772 0.255780 0.256665 0.207627 0.201161 0.351041 0.362158 0.358248 0.305046 0.342302 0.336270
chargesum: 0.00000
title: Mulliken charges with hydrogens summed into heavy atoms:
elementType: S O O O O O N N C C C C C C C C C
charge: 0.320233 -0.276408 -0.090412 -0.068017 -0.076571 -0.263412 -0.068013 0.058091 0.057668 0.119261 0.150108 0.147110 0.087653 -0.185232 0.281544 -0.326277 0.132675
polarizability: 1.70001964e+02 -6.74748135e+00 1.50449829e+02 2.65090923e-01 1.73295319e+01 1.01321025e+02
1716.lowfreq: -9.8761 -7.0508 0.0018 0.0021 0.0024 2.2625 19.2067 42.9214 56.1750
frequency: 18.7938 42.8558 56.1536 68.3090 88.8379 93.3748 114.7020 162.5568 169.3145 206.4675 227.8345 247.3043 280.0815 289.7209 306.0561 350.6091 354.1751 365.9338 420.9464 462.5933 476.1536 484.9849 512.7573 546.2108 557.0604 564.6488 602.4572 607.8735 618.7203 633.1589 661.6604 746.9245 775.1047 790.9138 804.8203 832.4135 900.3667 928.8180 954.3791 961.2762 989.0623 1008.1571 1042.0609 1047.3628 1060.5475 1069.4479 1078.6617 1097.5161 1114.1046 1167.5252 1182.2498 1211.2755 1221.3568 1251.5322 1261.7309 1286.1795 1307.9470 1320.1857 1343.7751 1350.9352 1359.1485 1376.4525 1381.6615 1396.5794 1454.0512 1502.5907 1515.1586 1570.8684 1633.7545 2968.3219 2983.8613 3001.0844 3028.7301 3058.3416 3061.1684 3252.7529 3510.9778 3540.4857 3570.0676 3582.3288 3674.4810
redmass: 6.4044 7.0946 6.6739 6.4532 4.0196 6.9297 4.2749 7.8836 4.1398 5.3549 6.0032 7.0876 4.1362 1.3369 2.9558 4.8113 2.4883 1.7998 3.4441 2.1857 1.7060 4.9729 3.0358 2.7038 4.6715 4.2255 2.6076 2.0186 1.6909 4.7194 6.0699 3.6425 3.1124 4.9814 4.9993 1.5938 4.2890 6.1533 5.6270 2.7319 5.1811 3.2597 3.6134 2.6693 1.9145 3.3537 2.7355 2.1236 1.9502 1.1782 1.1853 1.2248 1.2714 1.9955 1.8032 1.2714 1.3095 1.3899 1.2932 3.4801 1.5750 1.4453 1.3027 1.4025 1.0892 7.2669 7.5623 1.4432 4.5787 1.0634 1.0836 1.0861 1.0850 1.0979 1.0891 1.0961 1.0448 1.0654 1.0660 1.0668 1.1046
irintensity: 0.7820 2.4267 1.3097 0.6488 3.1518 13.7507 8.3118 0.4056 5.8565 2.6956 12.9942 3.3520 13.4226 106.5633 8.0527 13.1556 67.3636 78.1957 15.0806 36.6138 112.0065 9.8283 18.0201 29.1314 26.6015 4.1018 73.1023 121.5653 0.5186 62.7182 10.3864 31.8787 22.0558 31.7136 16.9568 37.3059 6.0293 105.2861 113.0219 96.9696 79.7234 27.5245 8.3020 29.6014 1.7812 13.6452 43.7992 19.0351 13.7904 37.3446 8.2192 19.7989 2.9535 28.7752 33.5473 12.7963 24.0566 4.2710 13.1038 83.9076 10.0617 14.5215 34.2500 3.9564 4.6158 11.9384 56.7744 170.8979 272.2086 46.5448 8.6794 31.0892 29.0306 55.0148 11.2720 11.2132 42.5454 11.3121 16.5683 11.9441 73.8648
temp: 298.150 k
press: 1.00000 atm
elementType: 16 8 8 8 8 8 7 7 6 6 6 6 6 6 6 6 6 1 1 1 1 1 1 1 1 1 1 1 1
symmnumber: 1
zpe: 562973.4 jmol-1
zpe.correction: 0.214425 hartree
zpe.thermalcorrener: 0.231581 hartree
zpe.thermalcorrenthalpy: 0.232525 hartree
zpe.thermalcorrgfe: 0.168089 hartree
zpe.sumelectzpe: -1232.512720 hartree
zpe.sumelectthermal: -1232.495565 hartree
zpe.sumelectthermalent: -1232.494621 hartree
zpe.sumelectthermalfe: -1232.559057 hartree
dipole: -3.5157 -0.8951 2.1040
dipole: 4.1938
quadrupole: -124.4418 -104.0336 -102.7229
quadrupole: -0.7273 -12.7057 10.5850
quadrupole: -14.0424 6.3658 7.6766 -0.7273 -12.7057 10.5850
hfenergy: -1232.7271455 hartree
pointgroup: C01 [X(C9H12N2O5S1)]
dipole: -1.3427503 0.5215765 -0.8046311 debye
polarizability: 169.9731302|5.1933817|142.1699921|3.9354234|25.3656508|109.6296964 unknown
InChI: InChI=1S/C9H12N2O5S/c10-8(15)3-2-17-9(11-3)7-6(14)5(13)4(1-12)16-7/h2,4-7,12-14H,1,10H2
charge 0 multiplicity 1
29 atoms
S  1.581757 1.929608 1.492199
O  -1.901874 -0.187622 1.3705
O  -3.370945 0.709295 -1.855361
O  -1.023238 2.542663 -0.9063
O  -2.415374 -2.966119 1.032535
O  4.299409 -1.13966 -0.776544
N  0.838723 -0.215618 0.109822
N  2.266899 -2.207987 -1.221926
C  -2.250704 0.340059 -0.984802
C  -1.874021 1.608599 -0.193743
C  -2.603024 -0.677674 0.125031
C  -1.146408 1.046717 1.053394
C  -2.138761 -2.116406 -0.123805
C  0.320789 0.775126 0.813015
C  2.243304 -0.156116 0.05049
C  2.820677 0.912767 0.719262
C  3.036031 -1.197092 -0.680111
H  -1.375999 0.002389 -1.577293
H  -2.82219 2.087635 0.128793
H  -3.687042 -0.648779 0.344073
H  -1.256214 1.719306 1.920297
H  -1.055387 -2.105498 -0.365643
H  -2.703082 -2.565751 -0.961017
H  -3.532065 -0.001588 -2.524139
H  -1.525193 2.883754 -1.689253
H  -2.008929 -2.522549 1.822311
H  3.88181 1.139469 0.790707
H  1.255051 -2.202392 -1.091991
H  2.727597 -2.967036 -1.720702
