program: Gaussian 09
title: 000100780
version: EM64L-G09RevD.01
frameworkgroup: C1[X(C13H12O3)]
method: RPBEPBE
basis: SDD
operation: Freq
keyword: #pfreq=noraman
keyword: PBEPBE/SDD
title: #p freq=noraman PBEPBE/SDD
converged: YES YES NO NO
title: Mulliken charges:
elementType: O O O C C C C C C C C C C C C C H H H H H H H H H H H H
charge: -0.435948 -0.554942 -0.231861 0.032111 0.522203 0.035329 0.447289 0.033812 -0.759519 0.277402 -0.481630 -0.810809 0.107427 -0.432872 -0.210782 -0.730359 0.243951 0.249887 0.265580 0.233044 0.214055 0.223804 0.231714 0.232897 0.259183 0.235647 0.413715 0.389669
chargesum: 0.00000
title: Mulliken charges with hydrogens summed into heavy atoms:
elementType: O O O C C C C C C C C C C C C C
charge: -0.022233 -0.165273 -0.231861 0.032111 0.522203 0.035329 0.447289 0.033812 -0.515568 0.277402 -0.231742 -0.098129 0.107427 -0.209068 0.020932 -0.002632
polarizability: 2.45668960e+02 -3.96711277e+00 1.68895802e+02 2.11651710e+00 1.66217777e-01 7.11702353e+01
1716.lowfreq: -9.0882 -2.1751 -0.0007 -0.0007 -0.0005 7.0328 55.3008 58.8622 90.8457
frequency: 55.2920 58.8442 90.8435 135.8611 165.8223 181.4593 199.9340 225.0662 264.2810 289.4632 302.9175 313.7860 320.1693 361.1748 389.9026 404.6548 474.0235 486.5629 498.7810 522.7437 543.1764 576.9139 584.2711 616.1836 622.0559 640.7977 695.3379 736.0564 758.1086 763.2186 801.3009 845.8865 847.0688 899.1204 950.7184 969.6348 1002.8077 1008.7070 1019.8223 1043.1903 1049.3204 1059.3057 1100.4727 1151.3954 1181.8778 1193.3985 1251.2716 1265.9011 1292.0582 1343.8328 1348.3398 1369.7472 1402.4679 1405.2266 1425.2313 1435.3046 1437.0749 1445.1331 1451.9623 1469.4345 1483.2301 1502.6233 1576.1846 1589.3508 1611.2071 1638.8592 2993.1387 2998.3992 3080.6249 3093.2455 3093.7024 3117.9018 3124.3784 3131.8957 3139.6856 3164.4637 3230.1565 3619.7425
redmass: 4.0617 5.7627 5.0837 3.8739 1.3388 1.1766 2.1466 4.4680 3.5145 2.1877 3.6902 4.0799 1.7809 5.0464 5.4018 4.9659 4.7037 5.2411 3.9190 4.7811 4.0952 6.4106 3.3000 3.9645 3.9485 4.7164 2.9101 1.1152 4.8079 1.6155 3.2373 2.2954 1.9753 1.6326 2.8031 1.3568 2.0733 2.8362 1.9317 2.0325 1.7440 2.9354 2.4662 1.3494 1.2491 1.8218 1.9839 3.1167 3.1736 3.6825 2.6722 1.2176 1.7216 1.6255 4.1270 1.3644 1.9016 1.0783 1.1145 1.3202 1.9661 3.5915 7.0527 6.0229 4.8728 6.0224 1.0367 1.0347 1.0973 1.0975 1.0980 1.1029 1.0887 1.0915 1.0896 1.0994 1.0669 1.0666
irintensity: 5.0401 1.1137 4.4174 2.8815 0.0962 0.6424 1.4846 6.1070 16.8210 49.0472 6.9813 11.0124 78.2544 3.9575 4.6267 1.4435 7.5889 3.3903 6.4743 13.5966 8.6643 5.3429 3.1131 0.8479 3.8974 6.7173 43.2184 61.4922 15.2990 106.0480 2.3878 7.7207 6.6787 24.6235 26.8717 3.1227 43.4371 19.7297 22.1636 36.6661 19.5297 28.8284 16.9444 27.4197 8.9043 26.6330 45.5567 151.7189 32.0304 190.1014 11.0420 52.9471 86.6795 18.6991 16.3489 13.5295 15.3763 17.9476 15.1519 2.4845 119.2783 62.8124 171.1457 46.7586 58.1068 154.6536 26.1767 5.1692 17.0219 8.1800 16.6412 23.4574 10.1721 8.1887 11.8537 23.1262 325.6317 60.1640
temp: 298.150 k
press: 1.00000 atm
elementType: 8 8 8 6 6 6 6 6 6 6 6 6 6 6 6 6 1 1 1 1 1 1 1 1 1 1 1 1
symmnumber: 1
zpe: 567828.5 jmol-1
zpe.correction: 0.216274 hartree
zpe.thermalcorrener: 0.230594 hartree
zpe.thermalcorrenthalpy: 0.231538 hartree
zpe.thermalcorrgfe: 0.175717 hartree
zpe.sumelectzpe: -727.128576 hartree
zpe.sumelectthermal: -727.114257 hartree
zpe.sumelectthermalent: -727.113312 hartree
zpe.sumelectthermalfe: -727.169134 hartree
dipole: 6.4566 -1.4125 1.2122
dipole: 6.7196
quadrupole: -89.2690 -78.9118 -97.9971
quadrupole: -7.0213 -5.6762 0.6125
quadrupole: -0.5431 9.8142 -9.2711 -7.0213 -5.6762 0.6125
hfenergy: -727.3448507 hartree
pointgroup: C01 [X(C13H12O3)]
dipole: 2.5121519 0.6500437 -0.5055604 debye
polarizability: 244.7799071|9.3694384|167.4294827|1.931322|-14.9305158|73.525608 unknown
InChI: InChI=1S/C13H12O3/c1-7-6-9-4-3-5-10(15)12(9)13(16)11(7)8(2)14/h3-6,15-16H,1-2H3
charge 0 multiplicity 1
28 atoms
O  -0.684176 2.043292 -0.306726
O  1.833526 2.449484 -0.319908
O  -3.88061 -0.286275 0.434793
C  0.933488 0.206385 -0.094082
C  1.163224 -1.210603 0.070584
C  -1.531799 -0.206337 -0.107075
C  -1.281744 -1.625945 0.074472
C  -0.429902 0.681619 -0.182556
C  0.037157 -2.086227 0.145624
C  2.087648 1.058702 -0.158871
C  2.507475 -1.70527 0.155075
C  -2.403983 -2.644189 0.165381
C  -2.947576 0.303601 -0.192127
C  3.391164 0.568381 -0.073912
C  3.595982 -0.835769 0.084907
C  -3.285202 1.505227 -1.066923
H  0.222754 -3.15972 0.263749
H  2.664743 -2.782106 0.27771
H  -2.979804 -2.518263 1.097184
H  -3.136751 -2.529232 -0.652594
H  -1.990936 -3.667102 0.128986
H  4.249517 1.249235 -0.127722
H  4.618842 -1.220335 0.151163
H  -2.643572 1.568602 -1.960999
H  -3.121716 2.436235 -0.495856
H  -4.349319 1.437638 -1.347848
H  0.187052 2.548276 -0.338791
H  2.660117 2.986393 -0.34794
