program: Gaussian 09
title: 000100898
version: EM64L-G09RevD.01
frameworkgroup: C1[X(C16H32O5P2S2)]
method: RPBEPBE
basis: SDD
operation: Freq
keyword: #p
keyword: freq=noraman
keyword: PBEPBE/SDD
title: #p freq=noraman PBEPBE/SDD
converged: YES YES NO NO
title: Mulliken charges:
elementType: S S P P O O O O O C C C C C C C C C C C C C C C C H H H H H H H H H H H H H H H H H H H H H H H H H H H H H H H H
charge: -0.146918 -0.143107 0.937316 0.934102 -0.481464 -0.483476 -0.444971 -0.430694 -0.721385 0.373246 0.389083 -0.065809 -0.113351 -0.085265 -0.069887 -0.431630 -0.416702 -0.767641 -0.770634 -0.771029 -0.772744 -0.724278 -0.709289 -0.722465 -0.711873 0.256699 0.239350 0.222706 0.221757 0.241144 0.252328 0.237946 0.269663 0.237076 0.216427 0.224978 0.246768 0.213552 0.238135 0.223609 0.235105 0.218402 0.245274 0.215226 0.244090 0.214162 0.224126 0.212879 0.207559 0.205292 0.262300 0.214092 0.223014 0.215072 0.204756 0.206553 0.260823
chargesum: 0.00000
title: Mulliken charges with hydrogens summed into heavy atoms:
elementType: S S P P O O O O O C C C C C C C C C C C C C C C C
charge: -0.146918 -0.143107 0.937316 0.934102 -0.481464 -0.483476 -0.444971 -0.430694 -0.721385 0.373246 0.389083 0.190890 0.125999 0.137441 0.151870 0.061842 0.090906 -0.089160 -0.072180 -0.093913 -0.068154 -0.073111 -0.034139 -0.070286 -0.039740
polarizability: 2.87278630e+02 1.50145952e+00 2.81813001e+02 8.88061536e+00 1.53867654e+01 2.52922289e+02
1716.lowfreq: -15.4213 -12.3150 -5.4448 -0.0013 -0.0009 0.0005 3.4508 13.1700 14.8143
frequency: -13.2903 9.4813 14.4054 34.4828 38.6114 57.6235 71.8862 90.5074 93.1561 102.9029 106.5537 130.1676 149.6498 160.7758 173.4507 187.6158 199.6388 207.2067 208.0679 219.2314 227.4633 235.5162 238.8879 242.1896 249.0612 254.8430 259.7459 264.6215 276.4251 279.0725 299.7532 301.4980 308.8798 313.1998 325.4602 334.9500 352.8936 361.4122 366.9886 385.0520 392.5818 403.5629 407.0281 424.7359 425.1937 452.9904 459.8893 491.4972 520.7017 526.8146 555.4905 565.1099 566.8955 632.9907 678.7111 684.4937 738.8975 755.5025 755.8605 758.1388 781.5253 841.8452 843.4675 859.7399 863.9337 893.6816 894.2777 897.1598 901.9287 921.4788 924.4038 931.6398 938.9537 941.1472 941.7158 955.2813 955.8752 974.0505 974.8870 982.4217 984.5348 1015.4347 1018.3458 1113.4106 1114.5287 1134.1712 1135.0935 1175.2076 1175.8005 1183.5478 1184.4420 1201.1468 1203.7211 1222.7946 1224.0844 1255.7648 1257.7278 1286.2841 1287.6024 1299.5005 1299.5482 1322.1996 1333.2099 1349.1644 1353.7213 1358.3440 1362.4327 1377.5741 1378.6061 1381.1984 1382.4062 1395.1529 1398.0686 1403.2677 1404.3799 1450.4047 1456.2020 1463.5309 1463.6149 1467.8026 1468.1795 1473.1410 1473.3263 1477.4232 1477.6098 1481.2926 1481.9329 1484.6044 1486.3136 1492.1906 1492.8183 1498.9213 1499.4221 2958.7501 2977.8201 2978.6987 2979.2095 2979.5401 2981.6603 2982.1395 2983.4311 2984.6799 2988.1271 3000.3592 3001.7364 3006.2946 3013.8617 3066.0240 3066.4871 3066.5712 3067.3803 3072.0965 3072.7417 3074.7543 3075.1471 3083.1295 3085.6950 3089.6106 3089.8004 3094.3434 3098.5188 3101.7836 3104.2886 3113.9138 3115.0120
redmass: 4.4940 5.4146 4.0520 4.0122 4.6608 4.8618 8.8893 2.9353 3.0641 6.4767 4.2868 6.1005 3.7132 2.9935 3.6650 2.8204 1.5396 3.0444 1.3053 1.6240 1.5187 1.0918 1.5039 1.5054 1.3073 1.7492 2.7399 1.6482 2.2654 3.2865 3.2008 3.0502 2.4353 3.0893 4.0846 7.4478 2.6249 2.5024 2.7823 5.9566 3.2671 2.6052 2.6827 2.4260 2.4220 4.2036 4.4873 6.0724 3.0897 3.3480 6.6062 4.8858 5.7123 13.6281 11.6478 12.9709 14.4070 4.1761 3.3789 5.8970 13.1493 3.1704 2.7098 3.7467 5.0043 2.4125 2.3841 3.1598 2.8804 1.2656 1.2056 1.9904 1.6001 2.0082 1.4941 1.4701 1.4970 1.6274 1.6156 1.8001 1.8646 1.4215 1.3853 2.2052 2.2383 2.1425 2.1088 1.8371 1.8225 1.9762 1.9484 2.3054 2.4145 2.9184 2.7881 1.3976 1.3416 1.4727 1.4138 1.3665 1.3893 1.2675 1.3022 1.3571 1.2708 1.2264 1.2394 1.1967 1.1964 1.1940 1.1917 1.2080 1.2077 1.1917 1.1918 1.0759 1.0714 1.0499 1.0527 1.0519 1.0501 1.0508 1.0504 1.0502 1.0500 1.0523 1.0517 1.0496 1.0507 1.0549 1.0545 1.0535 1.0528 1.0841 1.0370 1.0367 1.0372 1.0375 1.0391 1.0391 1.0378 1.0375 1.0808 1.0828 1.0635 1.0844 1.0603 1.0990 1.0989 1.0991 1.0991 1.0992 1.0993 1.0982 1.0982 1.0994 1.1002 1.1005 1.0988 1.1012 1.1045 1.0972 1.0981 1.0977 1.0978
irintensity: 0.4687 0.2976 0.4919 0.0473 0.2109 0.2093 0.1047 0.0626 0.0222 1.8680 0.5024 1.3081 0.5745 3.4604 0.5950 0.7142 1.0022 0.9345 1.1884 0.0481 2.1807 0.2480 3.2445 0.9742 1.0805 1.1814 1.3230 0.7746 0.9316 0.3980 4.2294 5.4544 1.1759 2.3431 3.0414 61.3429 3.8741 9.4149 9.3194 15.6744 4.9413 1.8628 8.7110 0.8073 0.7282 4.5198 21.8354 2.5412 5.4329 2.3250 71.9015 9.3866 9.9315 29.6508 36.9932 122.9508 580.5160 85.1031 24.1744 168.8436 736.8454 66.2921 10.7750 24.5726 2.2684 5.2810 36.1614 53.8982 28.2721 3.6731 0.7003 89.8755 7.1256 103.0284 5.4444 6.8313 8.0453 19.1493 28.6515 35.3520 58.2742 2.1031 0.6215 0.5111 0.2937 0.9310 0.9317 5.1265 3.9188 4.3646 6.1354 1.5154 1.7256 1.0098 0.6492 1.8105 2.1501 0.2995 0.3601 0.5159 0.3859 2.2196 6.3366 2.1717 0.7366 1.4320 2.2676 12.3055 12.6923 23.4698 20.8350 23.6712 24.5663 20.7502 19.4405 3.5920 3.7762 6.8218 4.1495 8.1269 5.0418 3.5977 2.6814 5.8639 14.9531 3.7665 4.1876 17.8641 18.7432 1.2802 3.3818 29.8431 35.3602 10.2012 19.5076 14.7496 24.9534 23.8929 29.5659 30.2857 23.9680 30.4034 4.4163 21.7330 24.6328 30.6018 17.0650 10.8313 3.0301 11.3575 1.6478 37.1000 34.8949 79.5595 99.0932 40.7535 31.6509 4.9093 28.1257 27.6428 20.9512 20.5970 16.9462 19.0098 15.8255
temp: 298.150 k
press: 1.00000 atm
elementType: 16 16 15 15 8 8 8 8 8 6 6 6 6 6 6 6 6 6 6 6 6 6 6 6 6 1 1 1 1 1 1 1 1 1 1 1 1 1 1 1 1 1 1 1 1 1 1 1 1 1 1 1 1 1 1 1 1
symmnumber: 1
zpe: 1228951.1 jmol-1
zpe.correction: 0.468083 hartree
zpe.thermalcorrener: 0.498621 hartree
zpe.thermalcorrenthalpy: 0.499565 hartree
zpe.thermalcorrgfe: 0.406581 hartree
zpe.sumelectzpe: -2481.559619 hartree
zpe.sumelectthermal: -2481.529081 hartree
zpe.sumelectthermalent: -2481.528136 hartree
zpe.sumelectthermalfe: -2481.621120 hartree
dipole: -0.0794 -7.0238 -3.3008
dipole: 7.7611
quadrupole: -158.0765 -196.5359 -182.0309
quadrupole: 2.6340 -1.2540 -1.6435
quadrupole: 20.8046 -17.6548 -3.1498 2.6340 -1.2540 -1.6435
hfenergy: -2482.0277018 hartree
pointgroup: C01 [X(C16H32O5P2S2)]
dipole: 0.1021743 2.9545044 -0.764298 debye
polarizability: 288.3220998|3.7386124|286.356035|-5.6561301|-8.8506167|247.3357847 unknown
InChI: InChI=1S/C16H32O5P2S2/c1-11(2)13-15(5,6)9-17-22(24,19-13)21-23(25)18-10-16(7,8)14(20-23)12(3)4/h11-14H,9-10H2,1-8H3
charge 0 multiplicity 1
57 atoms
S  1.729238 -3.567486 -0.888478
S  -1.870276 -3.001938 1.490672
P  1.668148 -1.577083 -0.474526
P  -1.427168 -1.435642 0.272887
O  2.88147 -0.99947 0.610626
O  -2.067623 0.155245 0.575823
O  1.859038 -0.392681 -1.755974
O  -1.913891 -1.621948 -1.387602
O  0.221895 -0.881027 0.195666
C  3.661221 1.036476 -0.660228
C  -3.248693 0.530817 -1.620206
C  2.995465 0.517274 0.673433
C  -3.432216 0.354008 -0.063164
C  3.702831 0.78774 2.024423
C  -4.0752 1.499686 0.756238
C  3.278771 0.07608 -1.830392
C  -2.006188 -0.294288 -2.081971
C  5.209621 1.043012 -0.60629
C  3.096775 2.444503 -0.991386
C  -2.957049 1.995107 -2.035429
C  -4.499037 -0.03244 -2.348462
C  3.821524 2.303025 2.332352
C  2.938778 0.089764 3.1775
C  -5.526768 1.810732 0.309619
C  -4.070583 1.146387 2.264677
H  1.959904 0.911619 0.724079
H  -4.017143 -0.57632 0.107088
H  4.72052 0.354009 1.968461
H  -3.455142 2.405845 0.608768
H  3.331483 0.600136 -2.798916
H  3.949288 -0.804409 -1.854032
H  -2.08558 -0.570721 -3.145941
H  -1.066305 0.262323 -1.90978
H  5.601102 0.059274 -0.289285
H  5.626987 1.268685 -1.606268
H  5.593673 1.808112 0.089075
H  3.239745 3.158037 -0.163934
H  3.60136 2.858749 -1.88432
H  2.014106 2.381664 -1.207549
H  -3.837588 2.646349 -1.902659
H  -2.121845 2.415239 -1.445868
H  -2.673886 2.03951 -3.104328
H  -5.435796 0.424608 -1.990934
H  -4.42453 0.157322 -3.4355
H  -4.571028 -1.125597 -2.198276
H  2.825828 2.786671 2.327711
H  4.249997 2.43677 3.342114
H  4.471514 2.843697 1.623513
H  1.907017 0.482219 3.258868
H  3.450859 0.277595 4.139036
H  2.877531 -0.997509 3.01685
H  -6.166419 0.910853 0.387295
H  -5.95499 2.580294 0.97708
H  -5.593166 2.193007 -0.722622
H  -4.683761 0.24509 2.458144
H  -4.500042 1.979734 2.850504
H  -3.049978 0.948393 2.626719
