program: Gaussian 09
title: 000100749
version: EM64L-G09RevD.01
frameworkgroup: C1[X(C12H8ClN5)]
method: RPBEPBE
basis: SDD
operation: Freq
keyword: #p
keyword: freq=noraman
keyword: PBEPBE/SDD
title: #p freq=noraman PBEPBE/SDD
converged: NO NO NO NO
title: Mulliken charges:
elementType: Cl N N N N N C C C C C C C C C C C C H H H H H H H H
charge: 0.020167 -0.269624 -0.292750 -0.009504 -0.059976 -0.117959 0.377221 -0.126737 0.245027 0.192522 -0.014900 -0.297338 0.248519 -0.395807 -0.331046 -0.787999 -0.241817 -0.225021 0.356906 0.245147 0.262482 0.290005 0.237439 0.237407 0.227587 0.230049
chargesum: 0.00000
title: Mulliken charges with hydrogens summed into heavy atoms:
elementType: Cl N N N N N C C C C C C C C C C C C
charge: 0.020167 -0.269624 0.064156 -0.009504 -0.059976 -0.117959 0.377221 -0.126737 0.245027 0.192522 -0.014900 -0.297338 0.248519 -0.150659 -0.068564 -0.023149 -0.014230 0.005028
polarizability: 3.21435715e+02 8.88826780e+00 1.93158589e+02 1.21878118e-02 -1.85027351e-04 7.03949276e+01
1716.lowfreq: 0.0015 0.0016 0.0024 3.7440 5.7667 6.9954 53.4484 90.7752 97.0405
frequency: 53.4239 90.7743 97.0389 132.5204 142.1059 150.6710 163.3172 248.8981 263.1484 278.4610 281.9591 308.7695 320.0483 359.7465 367.3614 446.5446 455.2921 511.1302 524.9270 568.6157 577.9666 615.7032 639.3397 668.2527 668.4244 677.2983 728.3134 759.0545 772.0406 774.4863 805.9855 853.7969 877.8358 926.5019 952.3417 955.6376 984.2201 987.3895 1010.8166 1020.0032 1047.1937 1089.1105 1111.4546 1163.2117 1167.9133 1195.3038 1205.5123 1240.5912 1271.5905 1302.5294 1371.4196 1385.5092 1399.1036 1409.7847 1431.7893 1450.3256 1463.0884 1471.6179 1471.7693 1516.0937 1562.3304 1585.2934 1623.0279 1651.2250 2971.5982 3045.3278 3117.3972 3132.1219 3146.5985 3161.8366 3172.4065 3573.3309
redmass: 4.7597 4.4252 6.7857 7.3464 1.5773 1.9628 4.8738 2.0112 2.1745 4.7337 5.2674 7.8564 6.9829 15.4759 5.0622 5.2076 3.3552 8.2319 7.2151 6.7014 4.2434 7.0575 7.3627 5.8289 8.4236 5.8768 4.9426 8.8091 1.4843 4.5012 6.8788 9.4975 1.4465 6.6701 1.3975 4.7733 2.5620 1.3236 2.6383 4.3103 1.4399 2.9481 2.4593 1.3924 3.5788 3.6268 3.7786 3.8475 4.2770 1.8378 4.1961 3.6164 1.8926 2.0852 3.1561 2.6683 2.8189 1.2437 1.0423 4.0320 6.5685 7.9692 8.2829 10.6776 1.0398 1.0989 1.0947 1.0856 1.0904 1.0956 1.0991 1.0801
irintensity: 0.4580 3.1378 2.7034 1.3536 2.6143 3.0814 2.0931 65.5284 44.0188 0.1815 0.0922 0.4183 0.0079 7.0172 5.0509 1.4177 2.5855 3.5391 2.5040 1.5952 0.0675 6.5803 0.7720 17.0223 1.5138 4.9440 13.9728 9.2402 84.5095 1.2057 0.4002 27.2425 0.3035 23.6108 3.8771 3.6673 11.1108 0.1392 7.5119 6.0446 3.2769 2.8724 20.7305 0.3668 14.2254 21.8716 51.3999 34.0246 63.6469 61.0916 8.2762 34.6604 88.2690 41.8021 28.0155 37.6840 1.7472 31.1320 22.1295 38.9074 3.3010 34.2673 48.7211 202.4204 26.0570 15.6255 0.9286 1.9013 11.5792 18.9670 25.4337 169.8253
temp: 298.150 k
press: 1.00000 atm
elementType: 17 7 7 7 7 7 6 6 6 6 6 6 6 6 6 6 6 6 1 1 1 1 1 1 1 1
symmnumber: 1
zpe: 478073.0 jmol-1
zpe.correction: 0.182088 hartree
zpe.thermalcorrener: 0.196263 hartree
zpe.thermalcorrenthalpy: 0.197207 hartree
zpe.thermalcorrgfe: 0.140906 hartree
zpe.sumelectzpe: -1194.598686 hartree
zpe.sumelectthermal: -1194.584512 hartree
zpe.sumelectthermalent: -1194.583568 hartree
zpe.sumelectthermalfe: -1194.639868 hartree
dipole: 1.1653 8.4148 0.0010
dipole: 8.4951
quadrupole: -90.6984 -121.2004 -113.1090
quadrupole: 20.3011 0.0049 0.0028
quadrupole: 17.6375 -12.8644 -4.7731 20.3011 0.0049 0.0028
hfenergy: -1194.7807743 hartree
pointgroup: C01 [X(C12H8Cl1N5)]
dipole: -0.4063955 3.3174345 -0.0003884 debye
dipolederiv: -0.1392344 -0.1312649 -0.0000015 -0.0304764 -0.8247715 0.0000289 0.0000775 -0.0000577 -0.005752 -0.0195296 0.0422384 -0.0000311 -0.1918204 -0.0639529 0.0000929 -0.0002412 -0.0000136 0.0470537 -1.2662368 0.3386276 0.0001539 0.2283226 -0.5427416 -0.000133 0.0008869 -0.0005095 -0.1950837 -0.6679953 0.3970109 -0.0000079 0.2615025 -0.4831701 0.0000064 0.0000446 -0.0000252 -0.2518931 -0.4217598 0.0164581 0.0000011 -0.2957118 -0.189152 -0.000001 0.0000779 -0.0000033 -0.2052733 -0.3868533 -0.123855 -0.0000041 0.0760421 -0.1487758 -0.0000006 -0.0000651 0.000008 -0.2389233 -0.1355309 0.0031429 0.0000537 0.7087856 -0.8896321 0.0000151 -0.0000823 0.0000756 -0.0120926 0.1303731 -0.076461 -0.0000458 -0.5485012 0.7870895 -0.0000112 -0.000006 0.0000919 0.0786297 0.0386898 -0.1608096 0.000005 -0.2427272 -0.0607086 -0.0000255 0.0000253 -0.0000926 0.006785 0.0777873 0.1034381 0.0000244 0.4763653 0.3307463 -0.0000002 -0.0000907 0.0000099 0.0998123 0.5784788 -0.213909 0.0000369 0.2381093 -0.0775354 0.0000077 0.0000105 -0.0000047 0.0483528 1.5386586 -0.2721597 -0.0000931 -0.3579212 1.5047729 -0.0000117 -0.0002795 0.0002164 0.0381629 0.5297531 0.0213169 -0.0000359 -0.2516445 0.1993714 -0.0000119 0.000045 -0.0000192 0.0396235 -0.0652303 0.0599032 0.0000036 0.0746009 0.0907039 0.0000351 0.0000203 0.0000275 -0.1481214 -0.2129882 0.0983591 -0.0000096 -0.12622 0.1513228 0.0000133 -0.0000083 0.0000232 -0.1532887 -0.0571845 -0.0056703 0.0000109 0.0451036 -0.0238631 -0.0000103 0.0000257 -0.0000281 0.1132585 -0.0132297 0.0444192 0.0000291 0.0549421 0.0650223 0.0000204 -0.0000035 0.0000364 -0.1691137 0.1162385 -0.0945459 0.0000223 -0.05096 -0.0949292 0.0000179 0.0000252 -0.0000049 -0.1586883 0.2557936 -0.0545 -0.0000552 -0.1419063 0.2368795 0.0000103 -0.000404 0.0002941 0.3414617 0.0851951 0.0480652 -0.0000038 -0.0234392 -0.0688404 -0.0000262 -0.0000005 -0.0000229 0.1583269 0.0958363 -0.0033069 -0.0000073 0.0444564 -0.0526247 -0.0000151 -0.0000106 -0.0000091 0.1680636 0.0159443 -0.0288913 0.0000044 -0.1304182 0.0760899 0.0000047 0.000015 0.0000076 0.1409176 0.0635461 -0.0000808 -0.0496201 0.1103952 0.0010832 -0.0952159 0.0155525 -0.1072291 -0.0326065 0.0635406 -0.0000785 0.0496175 0.1104083 0.0010616 0.0952374 -0.0155696 0.1072536 -0.0326463 -0.0786215 -0.0875277 -0.0000305 -0.1184467 0.0157653 -0.0000258 -0.000029 -0.0000216 0.1636382 -0.1254412 0.0800812 -0.000017 0.0811593 0.0607887 -0.0000018 -0.000016 -0.0000027 0.1593966 unknown
polarizability: 321.1247966|-10.8990044|193.469507|0.0121892|-0.0000065|70.3949276 unknown
InChI: InChI=1S/C12H8ClN5/c1-6-15-16-12-10-9(11(13)17-18(6)12)7-4-2-3-5-8(7)14-10/h2-5,17H,1H3
charge 0 multiplicity 1
26 atoms
Cl 0.131258 3.383395 -0.00063
N  -2.305691 0.228812 -0.000567
N  -1.757512 1.509511 -0.000553
N  0.845077 -1.768172 -0.00062
N  -2.388838 -2.020677 -0.000502
N  -3.711319 -1.497577 -0.000491
C  0.46563 0.566387 -0.000484
C  -0.100643 -0.819845 -0.000548
C  1.909149 0.372244 -0.000359
C  -1.536204 -0.962276 -0.00054
C  2.085641 -1.062079 -0.000478
C  -0.379754 1.649613 -0.000621
C  -3.652627 -0.142708 -0.000535
C  3.029924 1.23152 -0.00015
C  3.373845 -1.633094 -0.000403
C  -4.79837 0.814165 -0.000513
C  4.318405 0.648795 -0.000086
C  4.487709 -0.763313 -0.000211
H  -2.399165 2.302883 -0.001282
H  2.915813 2.32002 -0.00004
H  3.490731 -2.720787 -0.000476
H  -5.73027 0.228202 -0.000457
H  -4.807455 1.460862 0.898401
H  -4.807565 1.460826 -0.899454
H  5.202347 1.295964 0.000056
H  5.500283 -1.181971 -0.000159
