program: Gaussian 09
title: 000100771
version: EM64L-G09RevD.01
frameworkgroup: C1[X(C18H18O3)]
method: RPBEPBE
basis: SDD
operation: Freq
keyword: #pfreq=noraman
keyword: PBEPBE/SDD
title: #p freq=noraman PBEPBE/SDD
converged: YES YES NO NO
title: Mulliken charges:
elementType: O O O C C C C C C C C C C C C C C C C C C H H H H H H H H H H H H H H H H H H
charge: -0.362303 -0.464755 -0.441291 0.623004 0.311794 -0.532745 -0.633807 0.500157 -0.633776 0.348469 -0.114568 0.241961 -0.622465 -0.432482 -0.361928 -0.385772 -0.350911 -0.027002 -0.025568 -0.587038 -0.587718 0.281035 0.218804 0.225440 0.257869 0.215307 0.224597 0.234734 0.245551 0.255849 0.267387 0.230904 0.232179 0.394276 0.384339 0.214970 0.219485 0.216944 0.219076
chargesum: 0.00000
title: Mulliken charges with hydrogens summed into heavy atoms:
elementType: O O O C C C C C C C C C C C C C C C C C C
charge: -0.362303 -0.070479 -0.056953 0.623004 0.311794 -0.251710 -0.189563 0.500157 -0.375907 0.348469 -0.114568 0.241961 -0.182561 -0.197749 -0.116376 -0.129923 -0.083524 0.203902 0.206610 -0.152583 -0.151698
polarizability: 2.80014552e+02 1.92526391e+01 2.08700834e+02 8.78054340e+00 -7.85107311e+00 1.46623514e+02
1716.lowfreq: -3.7771 -0.0004 0.0004 0.0005 2.0021 5.1871 14.4145 26.2389 29.2081
frequency: 14.3870 26.1732 29.2063 35.5023 54.7142 66.7590 77.7634 104.6716 122.9439 155.8942 193.2406 201.4758 223.8433 241.0394 259.8531 269.8090 295.6325 350.6199 358.6239 373.7839 387.1425 389.3307 413.5327 440.9465 458.8477 477.6996 485.4158 516.7420 528.7838 548.2813 578.8473 587.7008 615.9200 635.5800 651.6618 684.1734 706.4825 721.3913 767.7405 784.4994 811.7978 833.3960 842.0866 856.0285 874.5265 906.7138 911.6962 925.6458 934.2607 947.3831 948.5630 954.7215 972.0914 974.8757 992.8724 1007.4382 1013.0634 1015.0247 1105.7638 1107.1186 1116.6448 1118.1210 1162.3593 1168.5511 1183.3137 1197.0136 1207.1212 1212.0516 1215.7325 1222.8825 1268.1600 1279.7376 1285.3720 1291.4831 1302.2755 1309.5750 1349.8558 1378.7602 1409.2648 1411.7260 1424.6673 1424.8100 1454.6239 1455.7839 1462.3660 1492.0522 1502.8017 1590.7440 1612.1011 1621.2388 1630.7173 1654.8545 1655.3731 2966.1901 2969.5111 3016.7431 3020.4405 3082.0495 3083.5100 3095.2815 3097.1281 3126.9333 3133.9189 3153.4138 3159.2862 3162.4640 3166.6428 3195.2777 3196.1281 3530.2982 3547.5099
redmass: 4.7565 3.7822 3.3767 4.1863 3.7992 3.5340 2.9993 2.8334 4.3144 4.3733 3.5714 4.8141 4.1484 4.0605 4.4127 5.2915 4.6994 4.4908 4.5334 3.0442 2.6745 2.5581 2.9376 1.1412 3.4550 1.1118 3.2959 2.6982 3.8741 2.8256 4.5741 2.5662 3.7297 3.7992 3.3250 3.1085 3.7781 3.2041 4.0797 4.3400 2.6730 1.2613 2.0489 1.4997 1.3871 1.4381 1.4930 2.4012 2.1013 1.3887 1.3848 1.3708 1.3732 3.6472 3.7493 2.6429 1.1925 1.1515 1.5642 1.8774 1.6186 1.9540 1.5953 1.4337 1.3203 1.6546 2.3406 1.3534 1.6695 1.9727 1.6324 1.3729 1.3250 1.2575 1.7389 1.3944 2.5268 5.1904 4.8832 3.0235 1.2213 1.1982 1.1066 1.1362 3.2880 2.5542 4.1454 7.2715 6.5179 6.8290 7.4938 4.6975 4.7078 1.0592 1.0593 1.1000 1.1002 1.0649 1.0629 1.0887 1.0909 1.0895 1.0890 1.0917 1.0924 1.0948 1.0957 1.1143 1.1143 1.0651 1.0649
irintensity: 0.1927 0.3427 0.3340 0.1071 0.0354 0.0475 0.0566 0.5462 0.4297 0.9863 0.8529 1.9056 4.9923 0.6835 0.6369 9.1573 8.2593 3.2352 10.4409 4.5315 1.8311 4.8743 1.3556 212.8304 3.7014 84.2302 11.4269 9.0050 5.2082 14.5668 6.0481 8.9417 17.5825 1.0439 9.1103 21.4913 2.1591 4.5175 0.7755 22.2488 25.1499 2.0416 52.2201 30.7911 2.2249 20.6645 12.4051 30.2897 10.1590 65.6550 73.2235 2.3181 0.9694 27.8051 96.9811 36.8203 14.1262 26.9743 8.1980 68.3776 6.0962 40.1502 454.4387 56.4461 12.0757 77.1514 105.1050 16.0953 2.4687 37.7622 77.2547 5.2309 21.8875 2.0865 36.5513 1.7593 141.3522 5.8044 1.2690 0.3983 4.3270 7.9351 25.7427 25.2686 30.3382 185.2967 134.3672 4.7384 144.7311 22.2469 20.5402 20.4883 10.2504 32.9175 30.5096 13.9437 13.0094 17.2310 16.9375 6.9512 7.9388 17.1312 9.3480 4.1574 1.9634 6.6403 3.8245 24.7205 26.2281 82.3575 84.0476
temp: 298.150 k
press: 1.00000 atm
elementType: 8 8 8 6 6 6 6 6 6 6 6 6 6 6 6 6 6 6 6 6 6 1 1 1 1 1 1 1 1 1 1 1 1 1 1 1 1 1 1
symmnumber: 1
zpe: 810748.6 jmol-1
zpe.correction: 0.308798 hartree
zpe.thermalcorrener: 0.329291 hartree
zpe.thermalcorrenthalpy: 0.330235 hartree
zpe.thermalcorrgfe: 0.256639 hartree
zpe.sumelectzpe: -920.818218 hartree
zpe.sumelectthermal: -920.797725 hartree
zpe.sumelectthermalent: -920.796780 hartree
zpe.sumelectthermalfe: -920.870377 hartree
dipole: 3.0427 -0.0251 0.3779
dipole: 3.0662
quadrupole: -128.2321 -115.8527 -121.7937
quadrupole: -2.8985 -1.8064 -1.5695
quadrupole: -6.2726 6.1068 0.1658 -2.8985 -1.8064 -1.5695
hfenergy: -921.1270158 hartree
pointgroup: C01 [X(C18H18O3)]
dipole: -1.199826 0.0394209 -0.118802 debye
polarizability: 278.7161062|-21.9216781|210.2180244|5.6389447|8.60487|146.4047694 unknown
InChI: InChI=1S/C18H18O3/c1-3-5-13-7-9-15(10-8-13)21-17-12-14(6-4-2)11-16(19)18(17)20/h3-4,7-12,19-20H,1-2,5-6H2
charge 0 multiplicity 1
39 atoms
O  0.462538 -1.67395 -0.697009
O  2.655357 -2.967711 0.339801
O  4.970153 -1.605686 0.953049
C  2.838344 1.229119 -0.204282
C  1.567009 -0.848285 -0.337925
C  1.63698 0.545764 -0.525827
C  2.948563 2.738346 -0.437149
C  -3.609323 -0.622365 -0.044161
C  3.949647 0.503742 0.292454
C  -0.875824 -1.24858 -0.461581
C  2.673638 -1.574335 0.145819
C  3.87085 -0.892663 0.46424
C  -5.087099 -0.309956 0.200509
C  -3.210462 -1.462873 -1.114057
C  -2.603479 -0.103176 0.811293
C  -1.85184 -1.778588 -1.330114
C  -1.240371 -0.410976 0.616238
C  1.740768 3.522323 0.041878
C  -5.363605 1.15046 0.510622
C  0.990859 4.345678 -0.733169
C  -6.013683 1.601338 1.612827
H  0.775445 1.098019 -0.91369
H  3.854054 3.108704 0.084054
H  3.102512 2.940954 -1.515973
H  4.886196 1.009116 0.548003
H  -5.664306 -0.606354 -0.698748
H  -5.469824 -0.930453 1.035742
H  -3.969141 -1.872633 -1.791762
H  -2.893457 0.550209 1.64228
H  -1.53797 -2.421416 -2.157993
H  -0.476713 -0.010177 1.289702
H  1.481491 3.394263 1.104089
H  -5.000571 1.872647 -0.236593
H  1.77125 -3.319023 0.058048
H  4.734758 -2.569565 1.001734
H  0.136219 4.898203 -0.32703
H  1.214374 4.492568 -1.797655
H  -6.198984 2.669094 1.774529
H  -6.383149 0.912719 2.383507
