program: Gaussian 09
title: 000100739
version: EM64L-G09RevD.01
frameworkgroup: C1[X(C5H9ClN4O3)]
method: RPBEPBE
basis: SDD
operation: Freq
keyword: #p
keyword: freq=noraman
keyword: PBEPBE/SDD
title: #p freq=noraman PBEPBE/SDD
converged: YES YES NO NO
title: Mulliken charges:
elementType: Cl O O O N N N N C C C C C H H H H H H H H H
charge: -0.045216 -0.274585 -0.263851 -0.231930 -0.181798 -0.390467 0.053237 -0.600678 -0.334386 0.338516 -0.432616 -0.568666 0.215329 0.269190 0.274290 0.265276 0.266027 0.392384 0.278127 0.292494 0.350101 0.329223
chargesum: 0.00000
title: Mulliken charges with hydrogens summed into heavy atoms:
elementType: Cl O O O N N N N C C C C C
charge: -0.045216 -0.274585 -0.263851 -0.231930 -0.181798 0.001917 0.053237 0.078646 0.209095 0.338516 0.098686 0.001954 0.215329
polarizability: 1.43952899e+02 3.81794380e+00 1.12465606e+02 5.04867091e+00 -5.00755283e+00 5.76988501e+01
1716.lowfreq: -9.6090 0.0019 0.0021 0.0023 2.2417 4.9855 23.2976 26.3652 48.9012
frequency: 22.8644 26.3553 48.8964 57.4213 79.2039 88.4875 112.2537 174.4514 193.2887 236.1736 252.9332 269.7208 331.2662 375.5666 436.8691 456.8546 470.5763 529.7588 541.1853 596.8258 637.7575 691.9317 712.2543 727.2344 768.8069 784.0719 818.0579 872.6519 936.7440 987.1259 1033.6437 1052.5588 1055.7672 1081.4982 1182.1427 1209.5283 1213.7534 1245.1864 1264.6464 1288.9596 1326.7854 1357.9023 1370.4602 1384.6166 1437.1962 1454.1388 1475.1728 1482.0578 1601.7586 1647.8880 1663.7411 2977.6680 3021.3447 3044.9271 3069.4213 3119.4253 3159.4244 3433.2925 3519.9397 3671.0239
redmass: 4.3890 7.7937 5.7035 3.3361 5.5455 7.7839 5.5786 3.9397 7.5670 6.0688 7.4210 8.9148 3.0316 5.3997 5.8611 11.5279 1.4232 4.4179 1.3093 5.6318 1.4728 6.8579 9.3137 2.3224 1.0998 1.8467 4.9995 2.7846 2.9551 2.0575 2.7203 1.7411 3.6285 2.5869 2.5419 1.6807 1.0846 2.2091 1.1705 1.6896 1.2730 1.3115 7.3410 3.3235 1.1171 1.0932 1.2779 1.8848 1.4456 5.7207 4.9007 1.0587 1.1019 1.0591 1.0557 1.1046 1.1129 1.0776 1.0452 1.1045
irintensity: 0.7280 0.0820 5.6489 1.9412 5.3975 3.8828 6.5224 10.3522 13.2879 35.5920 3.7341 1.9330 6.2033 15.2630 9.6586 1.7541 7.5015 22.1215 195.8154 11.3579 108.8704 39.4051 39.5708 1.7326 117.4297 67.5263 31.3320 23.5350 142.0802 1.4703 55.7287 8.8672 3.2928 7.3728 17.0484 2.3436 0.0670 14.9762 5.1482 31.6991 11.2873 0.3427 290.2574 182.3815 23.7253 10.3581 134.4168 408.9911 101.8504 274.9640 212.4559 33.3068 13.9955 2.2361 13.3740 1.2501 2.7813 120.5705 53.5956 35.6169
temp: 298.150 k
press: 1.00000 atm
elementType: 17 8 8 8 7 7 7 7 6 6 6 6 6 1 1 1 1 1 1 1 1 1
symmnumber: 1
zpe: 419192.2 jmol-1
zpe.correction: 0.159662 hartree
zpe.thermalcorrener: 0.173981 hartree
zpe.thermalcorrenthalpy: 0.174925 hartree
zpe.thermalcorrgfe: 0.115000 hartree
zpe.sumelectzpe: -1099.633428 hartree
zpe.sumelectthermal: -1099.619109 hartree
zpe.sumelectthermalent: -1099.618165 hartree
zpe.sumelectthermalfe: -1099.678090 hartree
dipole: -5.7842 -3.6267 -0.2009
dipole: 6.8301
quadrupole: -67.3514 -95.1959 -80.7440
quadrupole: 17.9633 0.3676 2.5872
quadrupole: 13.7457 -14.0988 0.3531 17.9633 0.3676 2.5872
hfenergy: -1099.7930904 hartree
pointgroup: C01 [X(C5H9Cl1N4O3)]
dipole: 2.441892 0.9416466 0.6093652 debye
dipolederiv: -0.5947826 0.1859798 0.0938709 0.1366742 -0.2328371 -0.0135507 0.1138811 -0.0283089 -0.1966961 -0.7766482 -0.0365218 -0.02514 0.1494394 -0.6867375 -0.3198371 0.1378331 -0.2837519 -0.6409611 -0.8162704 -0.0259548 0.0197227 -0.205447 -0.6879435 -0.2775178 -0.128931 -0.2975132 -0.5955879 -0.5137639 -0.6530642 -0.5127264 -0.1018123 -0.5764115 -0.3187999 -0.0998498 -0.3000393 -0.4182143 -0.7138639 -0.0404571 -0.0606221 -0.4296648 -0.812103 -0.4987253 -0.5286441 -0.4958035 -0.5578359 -1.432108 0.0257344 0.0794315 0.2968757 -0.4242874 -0.0392807 0.3709802 -0.0135978 -0.4583529 -0.0144182 0.4164954 0.3095286 0.2441732 0.8671189 0.7453251 0.2971769 0.7661014 0.6038824 -1.2139879 -0.3058656 -0.225518 -0.2155089 -0.5429377 0.1688607 -0.1325335 0.1806655 -0.5313843 0.2300348 -0.0557577 -0.0330808 -0.1187893 0.0672934 -0.0789829 0.0191911 -0.0671778 0.1080641 2.2028086 0.2849869 0.1481053 0.0540953 0.8917225 0.5436509 -0.1142304 0.4893127 0.7708481 0.3440507 0.1475129 0.1440858 0.3630145 0.1722587 -0.18784 0.3232614 -0.1752442 0.1663174 0.7267766 -0.2111613 -0.1303419 -0.2051013 0.248832 0.0781768 -0.1090351 0.029964 0.1688306 1.648115 0.2733674 0.0944589 0.3010589 0.7669438 0.4646144 0.1029229 0.4685538 0.6032471 0.030523 -0.0098627 0.0267946 -0.0539937 0.002378 0.0211658 -0.0527093 -0.024885 0.1091621 0.0993907 0.0400074 -0.0216974 0.0641077 0.1020296 -0.027134 -0.0203708 0.0042951 -0.0098735 -0.0266602 -0.0110391 0.0180165 -0.1059157 -0.0744813 0.0372228 -0.0188154 0.0416027 0.0753211 -0.0418629 0.0081609 -0.0254191 -0.0423131 0.081698 0.0226949 -0.1106469 0.0075944 -0.0671516 0.4676883 -0.0026605 -0.0052198 -0.1195415 0.2719708 -0.0255908 -0.1132721 -0.0397299 0.2900155 -0.0072178 0.0372133 0.0341601 0.0227272 0.0662553 -0.0619771 0.0029516 -0.0003725 -0.0703107 -0.0372033 -0.0656081 0.0318419 -0.0230419 -0.0159209 0.0042715 0.0320586 -0.0234081 0.0811813 0.2047132 -0.0043378 0.0178603 -0.0250952 0.2636883 -0.1129967 -0.0013253 -0.1150456 0.2918782 0.2346865 0.0028322 0.0218887 0.0140587 0.2514706 -0.1237499 0.0301068 -0.1232122 0.2776206 unknown
polarizability: 144.5780067|0.7081462|90.1818101|-1.9463542|27.2821592|79.3575386 unknown
InChI: InChI=1S/C5H9ClN4O3/c6-1-2-10(9-13)5(12)8-3-4(7)11/h8H,1-3,7H2
charge 0 multiplicity 1
22 atoms
Cl -4.877839 1.423967 0.471113
O  -0.190977 1.202059 1.423251
O  3.340896 -1.167182 -1.065903
O  -2.024801 -2.022228 -1.306828
N  -1.205246 -0.443864 0.084827
N  1.153812 -0.157424 0.079736
N  -0.973168 -1.445112 -0.875042
N  4.81097 0.261249 0.032105
C  -2.554263 -0.102333 0.590207
C  -0.039602 0.266503 0.584924
C  2.399234 0.474203 0.496231
C  -3.153542 1.070742 -0.201956
C  3.552547 -0.221334 -0.252014
H  -3.183651 -1.001169 0.476417
H  -2.460961 0.169366 1.652709
H  2.389239 1.558057 0.265789
H  2.541697 0.383404 1.591366
H  1.218791 -0.92598 -0.603361
H  -3.287898 0.833804 -1.267101
H  -2.577776 1.996044 -0.060687
H  5.611952 -0.164075 -0.434438
H  4.968588 1.023201 0.689954
