program: Gaussian 09
title: 000100738
version: EM64L-G09RevD.01
frameworkgroup: C1[X(C9H11ClN4O2)]
method: RPBEPBE
basis: SDD
operation: Freq
keyword: #p
keyword: freq=noraman
keyword: PBEPBE/SDD
title: #p freq=noraman PBEPBE/SDD
converged: YES YES NO NO
title: Mulliken charges:
elementType: Cl O O N N N N C C C C C C C C C H H H H H H H H H H H
charge: -0.048527 -0.277482 -0.241289 -0.181139 -0.395960 -0.115736 0.050914 -0.416811 -0.335475 0.203476 0.323868 -0.568880 -0.298647 -0.177718 -0.171199 -0.361126 0.256973 0.256325 0.267394 0.274199 0.406064 0.278466 0.291354 0.243167 0.245612 0.253700 0.238477
chargesum: 0.00000
title: Mulliken charges with hydrogens summed into heavy atoms:
elementType: Cl O O N N N N C C C C C C C C C
charge: -0.048527 -0.277482 -0.241289 -0.181139 0.010104 -0.115736 0.050914 0.096487 0.206118 0.203476 0.323868 0.000940 -0.055480 0.067895 0.067278 -0.107426
polarizability: 2.06122538e+02 5.57632948e+00 1.49961332e+02 7.91294989e+00 3.69277317e+00 7.04769087e+01
1716.lowfreq: -7.1548 -3.6855 -0.0012 -0.0010 0.0022 0.9286 17.5046 28.2054 43.4672
frequency: 17.3044 27.4831 43.4656 57.4819 71.0237 74.2790 113.1679 165.6738 180.2593 196.4051 214.8094 240.8208 257.0033 333.9447 363.1484 406.6167 433.5916 455.0701 458.6949 543.0340 589.4581 622.5874 690.5311 710.6844 733.1020 734.7058 761.5148 784.4078 815.1274 835.0421 864.7956 899.8415 935.3371 959.2691 972.0371 998.2516 1004.8763 1032.4560 1039.9000 1054.1276 1061.9789 1096.5175 1166.6798 1169.7946 1208.1577 1211.7419 1231.4874 1240.8230 1266.4631 1290.5688 1307.0608 1326.2613 1352.9423 1359.4369 1367.6283 1419.2231 1436.2030 1454.0763 1454.9012 1471.0966 1479.8767 1567.1025 1591.2558 1656.6459 2970.9293 3008.2145 3045.1574 3069.3048 3120.7070 3136.9315 3142.8522 3157.0748 3159.3741 3177.1762 3382.7712
redmass: 7.1136 6.6471 5.2927 3.6246 6.5138 4.3331 6.3109 6.3017 6.3926 2.5688 7.1580 7.4882 9.7410 2.9282 6.5109 3.1825 7.6922 11.3647 2.7482 5.8889 5.8260 7.0713 6.7325 8.4722 2.3349 3.0224 1.1962 2.1595 4.6516 1.1195 3.5263 1.2790 3.0075 1.4426 6.8765 1.8218 1.3750 3.2333 2.3354 2.4704 2.7163 1.6468 1.2855 1.7232 1.7307 1.0769 2.0943 2.4192 1.1715 1.7390 3.6529 1.3243 1.5977 2.2633 2.7818 2.0545 1.1256 1.6446 1.2141 2.2868 1.2138 6.0352 5.7440 10.8774 1.0592 1.1012 1.0592 1.0558 1.1045 1.0876 1.0903 1.0953 1.1129 1.1014 1.0780
irintensity: 0.2410 0.1610 0.0620 0.6642 1.0727 1.8854 6.3486 5.1869 5.1143 13.2626 13.4857 3.5833 1.9079 7.3382 29.2850 4.3161 6.6443 1.3648 8.4620 13.4528 2.4942 0.0516 43.8234 32.7001 0.6738 1.5265 91.4636 52.9440 39.6740 80.7553 21.6763 0.0369 152.5803 0.0280 1.2171 2.2213 0.5064 39.7076 29.5944 12.8394 4.5164 4.0107 3.1277 26.8312 5.8571 0.0342 19.8794 1.0969 8.9295 1.2787 18.7032 22.7966 7.1849 101.3778 94.0653 40.0209 19.0230 158.1707 49.4769 569.2637 38.3861 18.7829 36.2136 326.0740 23.2947 13.8425 2.5592 13.6798 1.1238 6.9894 1.9724 20.2685 2.8069 20.1305 216.0959
temp: 298.150 k
press: 1.00000 atm
elementType: 17 8 8 7 7 7 7 6 6 6 6 6 6 6 6 6 1 1 1 1 1 1 1 1 1 1 1
symmnumber: 1
zpe: 527850.7 jmol-1
zpe.correction: 0.201048 hartree
zpe.thermalcorrener: 0.216669 hartree
zpe.thermalcorrenthalpy: 0.217614 hartree
zpe.thermalcorrgfe: 0.154337 hartree
zpe.sumelectzpe: -1177.837902 hartree
zpe.sumelectthermal: -1177.822281 hartree
zpe.sumelectthermalent: -1177.821336 hartree
zpe.sumelectthermalfe: -1177.884613 hartree
dipole: 7.2983 -1.1750 0.5567
dipole: 7.4132
quadrupole: -87.3208 -107.3166 -99.4878
quadrupole: -3.3958 2.1632 -0.3137
quadrupole: 10.7209 -9.2749 -1.4461 -3.3958 2.1632 -0.3137
hfenergy: -1178.0389501 hartree
pointgroup: C01 [X(C9H11Cl1N4O2)]
dipole: 2.9093408 0.1866292 -0.0856265 debye
polarizability: 203.7682732|6.6658719|77.1514189|14.4222468|-21.983439|145.6410859 unknown
InChI: InChI=1S/C9H11ClN4O2/c10-4-6-14(13-16)9(15)12-7-8-3-1-2-5-11-8/h1-3,5,12H,4,6-7H2
charge 0 multiplicity 1
27 atoms
Cl -5.941259 -0.930357 -1.31404
O  -1.4583 0.733627 -1.825107
O  -2.842172 -0.735434 2.313327
N  -2.242129 0.02717 0.276431
N  0.086411 0.263145 -0.132447
N  2.325785 -0.070861 1.179418
N  -1.867072 -0.413492 1.553616
C  1.262549 0.567792 -0.942507
C  -3.652991 0.150843 -0.153205
C  2.518231 0.340339 -0.108703
C  -1.166952 0.372628 -0.647376
C  -4.129784 -1.140692 -0.837126
C  3.808805 0.549113 -0.651571
C  4.935339 0.32377 0.167346
C  4.741663 -0.102486 1.503351
C  3.420484 -0.285809 1.964584
H  1.226957 1.615811 -1.302598
H  1.284533 -0.066045 -1.851658
H  -4.256425 0.348429 0.748975
H  -3.719313 0.995633 -0.855288
H  0.272712 -0.036777 0.838175
H  -4.094404 -2.009458 -0.164346
H  -3.590091 -1.330346 -1.775558
H  3.923024 0.879468 -1.6897
H  5.945253 0.476995 -0.226811
H  3.217708 -0.614215 2.989548
H  5.588838 -0.288291 2.170069
