program: Gaussian 09
title: 000100746
version: EM64L-G09RevD.01
frameworkgroup: C1[X(C20H15NO)]
method: RPBEPBE
basis: SDD
operation: Freq
keyword: #p
keyword: freq=noraman
keyword: PBEPBE/SDD
title: #p freq=noraman PBEPBE/SDD
converged: YES YES NO NO
title: Mulliken charges:
elementType: O N C C C C C C C C C C C C C C C C C C C C H H H H H H H H H H H H H H H
charge: -0.281784 -0.386124 -0.361895 0.273079 0.280153 0.158487 0.151597 -0.427193 -0.424383 -0.389494 -0.388694 -0.236058 -0.236591 -0.233051 -0.232968 0.191740 0.253657 -0.351014 -0.359594 -0.224404 -0.237298 -0.226463 0.284953 0.305789 0.256946 0.258630 0.240688 0.240591 0.228197 0.228200 0.227479 0.227342 0.275131 0.217867 0.233059 0.230365 0.233057
chargesum: 0.00000
title: Mulliken charges with hydrogens summed into heavy atoms:
elementType: O N C C C C C C C C C C C C C C C C C C C C
charge: -0.281784 -0.080335 -0.076942 0.273079 0.280153 0.158487 0.151597 -0.170248 -0.165753 -0.148805 -0.148103 -0.007861 -0.008391 -0.005572 -0.005626 0.191740 0.253657 -0.075882 -0.141726 0.008655 -0.006933 0.006594
polarizability: 2.93000365e+02 7.68490465e+00 2.47714986e+02 2.05523275e+01 8.51402749e+00 1.47134801e+02
1716.lowfreq: -7.2071 -4.2111 -0.0008 -0.0007 -0.0005 3.3327 14.4139 26.1502 41.0281
frequency: 14.2157 26.1387 41.0275 50.4169 89.3092 131.3809 137.7022 158.2115 163.5840 243.1438 251.9522 279.6133 303.5353 380.7212 403.1603 410.9958 413.0376 429.8131 443.4005 475.2983 507.0141 554.7700 569.3002 577.6412 612.0293 614.6599 623.6580 632.7055 668.9405 685.8036 702.7172 727.9760 744.5885 746.6830 764.9047 790.3591 792.3969 801.8599 850.1658 855.3511 876.3958 886.0395 911.4660 935.9882 953.2527 955.7524 984.6772 987.9711 989.4993 989.9654 995.4282 1005.7432 1019.8582 1021.1627 1029.6202 1042.3138 1083.8705 1097.0283 1107.1600 1138.6250 1167.8136 1170.8547 1173.7533 1188.1787 1191.2321 1200.9579 1207.8150 1242.7645 1249.4734 1296.0973 1299.2742 1310.4886 1318.3626 1376.7482 1384.7139 1403.3740 1432.2394 1439.4008 1444.5798 1463.7366 1466.0658 1481.3610 1490.2507 1567.7704 1593.0930 1593.4986 1602.4263 1611.1557 1618.2557 1620.1447 2976.3437 3119.5927 3124.1223 3125.2361 3132.2143 3132.8927 3134.5748 3144.8214 3145.5848 3146.2361 3159.0172 3162.2630 3163.2488 3170.1580 3556.2112
redmass: 4.6714 5.5472 5.2693 5.2541 4.5197 3.9998 5.0627 4.7320 5.4114 5.0321 5.3699 5.4554 4.5456 5.1837 2.8227 5.9538 4.0724 3.6087 3.0179 4.3680 4.4155 1.7888 3.0146 3.0946 4.9251 6.1507 4.0838 5.4015 6.0864 4.9768 1.5345 4.9830 1.7998 2.5299 1.6802 2.0499 2.3284 5.8546 3.2404 1.2623 1.4379 1.6807 3.2116 1.4409 1.4251 1.5238 1.4202 1.3337 2.1830 2.0818 6.3320 1.3421 2.2582 3.0414 2.0028 3.4441 1.6170 2.1423 1.7185 2.6302 1.1905 1.0877 1.0585 1.7755 1.1457 2.2149 1.4870 2.0193 1.6822 1.5188 1.8252 1.7656 1.3476 8.9116 9.0700 3.5911 2.2197 2.2229 2.8226 1.9502 2.6275 3.9619 2.3024 6.5859 7.0900 6.5611 6.6613 6.0587 7.4363 7.0854 1.0803 1.0871 1.0853 1.0852 1.0871 1.0894 1.0896 1.0949 1.0922 1.0950 1.0958 1.1003 1.1003 1.1005 1.0775
irintensity: 1.5288 0.2137 2.1842 3.2568 1.4357 0.3406 0.4071 1.2269 1.8707 4.7829 1.8222 15.4713 3.0965 0.2760 0.2047 0.4855 0.4576 11.8749 0.8628 1.1823 1.6333 37.1531 11.5099 50.4166 1.2631 1.1488 25.3567 6.6541 3.6046 7.9695 87.7004 1.9871 0.5546 66.2093 96.8784 2.4280 18.8067 8.5557 10.2233 0.6345 1.4578 0.8100 5.4240 2.6367 0.0548 4.3562 1.4762 0.0176 0.9155 0.1565 3.8789 1.6526 3.9681 3.9728 5.5516 9.3418 26.0892 0.9362 0.5728 6.9861 0.9861 2.3003 1.0813 0.6312 4.4207 29.6455 3.7877 6.2490 39.5738 6.9246 24.2558 133.2580 12.4290 7.2539 1.5448 0.0634 6.6137 30.3494 12.3514 229.6543 8.3190 0.1764 144.0599 106.4124 0.3203 0.3900 49.5537 4.7166 4.6671 1.8609 55.5891 10.9347 2.8810 1.0797 2.0739 5.8182 1.1536 9.4145 22.8766 43.4893 15.8643 53.6212 16.8048 21.8120 13.5787
temp: 298.150 k
press: 1.00000 atm
elementType: 8 7 6 6 6 6 6 6 6 6 6 6 6 6 6 6 6 6 6 6 6 6 1 1 1 1 1 1 1 1 1 1 1 1 1 1 1
symmnumber: 1
zpe: 763698.4 jmol-1
zpe.correction: 0.290877 hartree
zpe.thermalcorrener: 0.307909 hartree
zpe.thermalcorrenthalpy: 0.308854 hartree
zpe.thermalcorrgfe: 0.243487 hartree
zpe.sumelectzpe: -899.648735 hartree
zpe.sumelectthermal: -899.631703 hartree
zpe.sumelectthermalent: -899.630759 hartree
zpe.sumelectthermalfe: -899.696125 hartree
dipole: 0.0758 -0.3781 -3.6824
dipole: 3.7025
quadrupole: -105.9179 -116.7409 -133.6143
quadrupole: 0.8831 -2.4865 1.6903
quadrupole: 12.8398 2.0168 -14.8566 0.8831 -2.4865 1.6903
hfenergy: -899.9396126 hartree
pointgroup: C01 [X(C20H15N1O1)]
dipole: -0.034656 0.2710354 -1.4308345 debye
polarizability: 293.3464081|6.6796525|247.4725322|-21.9531633|1.0959494|147.031212 unknown
InChI: InChI=1S/C20H15NO/c22-20(14-8-2-1-3-9-14)21-19-17-12-6-4-10-15(17)16-11-5-7-13-18(16)19/h1-13,19,21H
charge 0 multiplicity 1
37 atoms
O  -1.759391 -0.335703 2.139356
N  -0.669534 0.068176 0.125805
C  0.673055 -0.117801 0.69628
C  1.630301 1.055126 0.458314
C  1.456556 -1.301877 0.117739
C  2.848514 0.588004 -0.118409
C  2.740563 -0.871841 -0.329775
C  1.442909 2.416104 0.747749
C  1.06925 -2.64764 0.018987
C  3.897189 1.490891 -0.396343
C  3.653432 -1.801046 -0.873207
C  2.493994 3.324476 0.460534
C  1.983776 -3.579729 -0.534991
C  3.710023 2.862911 -0.102753
C  3.264392 -3.158347 -0.972929
C  -1.815292 -0.036222 0.902622
C  -3.127707 0.207826 0.202362
C  -4.299512 -0.297955 0.821199
C  -3.242896 0.932194 -1.01353
C  -5.562304 -0.106046 0.224148
C  -4.508724 1.128721 -1.608056
C  -5.670359 0.604531 -0.994983
H  0.493105 -0.26833 1.781685
H  -0.741868 0.208198 -0.882839
H  0.505004 2.770537 1.189784
H  0.081845 -2.972599 0.365218
H  4.840623 1.143843 -0.832476
H  4.645385 -1.485007 -1.214921
H  2.368337 4.390662 0.679474
H  1.701412 -4.634793 -0.621819
H  4.513082 3.578122 -0.313593
H  3.95956 -3.893269 -1.39429
H  -4.19103 -0.829706 1.772071
H  -2.361666 1.38155 -1.487734
H  -6.460689 -0.505462 0.707166
H  -4.589898 1.696867 -2.541153
H  -6.651438 0.756935 -1.458392
