program: Gaussian 09
title: 000009741
version: EM64L-G09RevD.01
frameworkgroup: C1[X(C6H4F2)]
method: RPBEPBE
basis: SDD
operation: Freq
keyword: #p
keyword: freq=noraman
keyword: PBEPBE/SDD
title: #p freq=noraman PBEPBE/SDD
converged: NO NO NO NO
title: Mulliken charges:
elementType: F F C C C C C C H H H H
charge: -0.199915 -0.199927 -0.500387 0.375801 0.375804 -0.381479 -0.381478 -0.133632 0.283072 0.261019 0.261016 0.240106
chargesum: 0.00000
title: Mulliken charges with hydrogens summed into heavy atoms:
elementType: F F C C C C C C
charge: -0.199915 -0.199927 -0.217315 0.375801 0.375804 -0.120460 -0.120461 0.106474
polarizability: 7.71054877e+01 -9.15645263e-05 7.23232503e+01 8.78857411e-05 -2.44107364e-04 2.59677923e+01
1716.lowfreq: -0.0009 0.0009 0.0011 6.4225 7.3458 21.8863 214.8323 235.9784 300.9901
frequency: 214.7996 235.9514 300.9901 442.3657 451.0163 494.7620 504.4681 583.4258 675.7670 711.9721 779.1347 861.3536 879.0909 922.2695 963.4237 986.1766 1069.8710 1106.3148 1167.6661 1238.8340 1269.9218 1383.0187 1439.9198 1469.7745 1605.7516 1606.1606 3148.6289 3170.5010 3177.4276 3181.4388
redmass: 7.5978 4.7833 13.2113 5.0828 3.0150 8.2764 9.9185 5.1853 2.3220 8.1173 1.3021 1.5835 1.3899 3.9877 1.3050 6.2898 1.5461 1.6227 1.1359 5.4930 1.3582 9.5314 3.2022 2.6587 7.9124 6.7717 1.0879 1.0932 1.0943 1.0992
irintensity: 0.2235 0.0000 3.9284 0.3346 5.5351 6.4048 6.2310 0.0000 23.6459 4.1118 55.7347 67.3608 0.0000 75.5000 1.6595 0.1320 9.7217 52.6291 1.3475 42.9447 2.7259 0.3948 13.4100 90.8434 64.0885 113.7092 6.3780 2.4157 0.2467 2.5587
temp: 298.150 k
press: 1.00000 atm
elementType: 9 9 6 6 6 6 6 6 1 1 1 1
symmnumber: 1
zpe: 215580.2 jmol-1
zpe.correction: 0.082110 hartree
zpe.thermalcorrener: 0.088249 hartree
zpe.thermalcorrenthalpy: 0.089193 hartree
zpe.thermalcorrgfe: 0.051750 hartree
zpe.sumelectzpe: -430.149478 hartree
zpe.sumelectthermal: -430.143339 hartree
zpe.sumelectthermalent: -430.142395 hartree
zpe.sumelectthermalfe: -430.179838 hartree
dipole: 0.0001 2.0612 0.0001
dipole: 2.0612
quadrupole: -49.6039 -38.8217 -46.9917
quadrupole: -0.0001 0.0005 0.0000
quadrupole: -4.4648 6.3174 -1.8525 -0.0001 0.0005 0.0000
hfenergy: -430.2315883 hartree
pointgroup: C01 [X(C6H4F2)]
dipole: 0.0001524 -0.8109208 -0.0000288 debye
dipolederiv: -0.8627076 -0.3665947 -0.0000501 -0.385643 -0.4393107 -0.0000263 -0.0001347 -0.0000874 -0.1513286 -0.8628908 0.3664794 -0.0000176 0.3855051 -0.4391067 0.000007 -0.0001146 0.0000884 -0.1513375 -0.4360426 -0.0000494 -0.0000572 -0.0000219 -0.1195305 0.0000057 -0.0000492 0.0000049 -0.183874 1.0295228 0.330785 0.0000938 0.4104501 0.6318276 0.000039 0.0002013 0.0001337 0.115708 1.0296873 -0.3306648 0.0000444 -0.4103374 0.6316325 -0.0000187 0.0001611 -0.0001299 0.1157016 -0.1394007 -0.0592924 -0.0000051 -0.2254838 -0.2549112 -0.0000217 -0.0000308 -0.0000193 -0.1906251 -0.139466 0.0593224 -0.0000067 0.2255142 -0.2548566 0.0000072 -0.0000191 0.0000096 -0.1906199 0.200076 -0.0000041 -0.0000084 0.0000032 0.1549681 0.0000155 -0.0000115 0.0000256 -0.1236671 0.1105382 0.0000138 0.0000135 0.000011 0.0215055 -0.0000012 0.0000012 -0.0000083 0.2113862 -0.008661 0.0519978 -0.0000023 0.0551123 0.075359 0.0000072 -0.000014 0.0000013 0.1941469 -0.0086284 -0.0520178 -0.0000006 -0.0551331 0.075333 -0.0000079 -0.0000127 -0.000005 0.194146 0.0879727 0.0000247 -0.0000036 0.0000234 -0.08291 -0.0000059 0.0000231 -0.0000135 0.1603637 unknown
polarizability: 77.1054876|0.0007358|72.3232504|-0.0000879|-0.0002441|25.9677923 unknown
InChI: InChI=1S/C6H4F2/c7-5-2-1-3-6(8)4-5/h1-4H
charge 0 multiplicity 1
12 atoms
F  2.407128 1.053824 0.000172
F  -2.407422 1.053176 -0.000074
C  -0.000125 1.085045 -0.000021
C  1.196575 0.345479 -0.000042
C  -1.196646 0.345168 0.000089
C  1.232978 -1.062645 0.000005
C  -1.232706 -1.062953 0.000041
C  0.00023 -1.756604 0.000022
H  -0.000287 2.179391 -0.00002
H  2.192999 -1.587661 0.000036
H  -2.192601 -1.588226 0.000005
H  0.000377 -2.851594 -0.000012
