program: Gaussian 09
title: 000100726
version: EM64L-G09RevD.01
frameworkgroup: C1[X(C12H16ClNO4Si)]
method: RPBEPBE
basis: SDD
operation: Freq
keyword: #p
keyword: freq=noraman
keyword: PBEPBE/SDD
title: #p freq=noraman PBEPBE/SDD
converged: YES YES NO NO
title: Mulliken charges:
elementType: Cl Si O O O O N C C C C C C C C C C C C H H H H H H H H H H H H H H H H
charge: -0.100304 1.560896 -0.514869 -0.545720 -0.511347 -0.614963 -0.293065 -0.371796 -0.367809 -0.372047 -0.277263 -0.274541 -0.280599 0.429818 -0.313083 -0.399258 -0.056227 -0.174598 -0.283893 0.232173 0.241760 0.232504 0.242022 0.231699 0.242507 0.234219 0.199372 0.235657 0.202783 0.234890 0.199448 0.300766 0.255697 0.224909 0.250260
chargesum: 0.00000
title: Mulliken charges with hydrogens summed into heavy atoms:
elementType: Cl Si O O O O N C C C C C C C C C C C C
charge: -0.100304 1.560896 -0.514869 -0.545720 -0.511347 -0.614963 -0.293065 0.102137 0.106717 0.102159 0.156329 0.163899 0.153739 0.429818 -0.012317 -0.143561 -0.056227 0.050311 -0.033633
polarizability: 2.19628321e+02 -3.14903507e+00 1.79946380e+02 -6.13761416e+00 -2.01307254e+00 1.19826303e+02
1716.lowfreq: -15.3651 -6.9263 -3.4624 -0.0015 0.0017 0.0022 13.3280 29.0228 48.3044
frequency: 11.5073 28.8354 48.2950 90.2439 122.6678 138.1792 171.4644 177.9448 190.6946 194.6653 235.0051 243.3348 278.3872 289.1222 299.0118 333.9734 338.4284 358.0487 380.4088 425.0745 425.9422 440.6089 466.1032 492.7473 531.1077 561.9669 563.9274 583.2578 585.2866 644.9964 677.9721 710.6079 719.5624 727.5405 747.7875 772.4981 865.5072 868.2211 875.0243 882.5507 884.7608 920.4584 922.5296 922.8050 962.9326 979.3822 1003.7636 1039.8814 1041.2304 1059.6180 1062.0874 1062.9186 1067.5232 1083.2739 1087.8196 1147.2973 1149.7642 1161.9756 1200.3747 1215.9176 1217.1430 1250.7975 1255.5445 1257.8301 1257.9314 1288.5807 1341.3560 1343.9008 1344.9891 1356.4349 1358.2014 1359.7735 1367.7415 1424.4552 1457.9607 1460.2661 1460.8805 1466.3400 1483.4007 1485.4349 1486.5316 1564.1960 1608.1772 2964.9523 2965.6225 2974.8722 2985.0004 2985.6063 2991.1030 3061.6652 3063.7085 3064.9547 3073.2861 3077.8149 3079.3215 3138.5091 3172.6025 3173.1452 3181.6804
redmass: 5.9071 5.2644 6.7652 4.6163 5.9163 4.4134 4.9864 3.1433 6.4627 3.5341 4.4880 4.9488 2.1374 4.4959 5.2213 3.6356 3.9260 5.8494 12.9785 3.4727 3.3721 3.1140 4.5969 6.9488 9.1607 4.5367 3.4470 2.7185 2.7466 7.0218 2.3270 10.0939 3.3583 8.0090 5.4699 1.3716 1.9203 1.9341 1.4056 1.4896 2.3813 6.5773 2.2052 2.2066 1.3211 5.8831 2.6822 2.5466 2.3426 4.9200 4.1761 1.8610 3.2604 1.6136 2.7044 1.7351 1.7360 1.0804 1.0910 1.2606 1.2613 1.1918 2.1456 1.5537 1.5004 1.6219 1.2863 1.2560 1.2621 1.2927 1.3059 1.2908 6.1648 3.4634 1.0904 1.0904 1.0846 2.6380 1.0806 1.0797 1.0818 6.8284 7.1985 1.0678 1.0680 1.0658 1.0632 1.0637 1.0635 1.0974 1.0972 1.0975 1.0995 1.1011 1.1015 1.0878 1.0928 1.0930 1.0983
irintensity: 0.3054 4.9648 2.8461 7.0569 2.0616 1.3650 1.2127 2.2144 29.1970 1.2702 5.9592 8.4278 9.0330 5.5468 16.3552 8.4382 15.0557 30.2054 4.0389 0.1100 0.6661 4.0832 20.5817 6.6351 2.7808 17.8154 81.6396 7.3281 5.2926 93.6446 12.0102 139.4069 55.4736 112.4314 82.9752 61.6463 7.8225 15.5917 31.2685 18.0733 158.0370 283.7301 19.8976 13.1769 1.8563 6.4022 38.2689 21.3261 13.2259 79.1114 96.3539 21.1544 96.9123 21.6435 121.1025 3.0921 2.7065 5.5580 2.7391 1.9371 3.6111 31.5563 160.7715 29.4812 11.0531 100.3021 4.1999 1.7269 0.9718 5.6836 2.3759 1.3648 33.0821 17.5884 15.9137 18.0388 3.7772 241.6695 9.9229 10.4029 6.3355 90.8702 209.3687 47.2263 50.9256 44.9020 18.6686 27.4630 133.8194 22.3421 31.8391 30.8965 3.5341 36.3576 38.1108 14.2833 5.8807 2.4963 9.5824
temp: 298.150 k
press: 1.00000 atm
elementType: 17 14 8 8 8 8 7 6 6 6 6 6 6 6 6 6 6 6 6 1 1 1 1 1 1 1 1 1 1 1 1 1 1 1 1
symmnumber: 1
zpe: 713731.2 jmol-1
zpe.correction: 0.271846 hartree
zpe.thermalcorrener: 0.289581 hartree
zpe.thermalcorrenthalpy: 0.290525 hartree
zpe.thermalcorrgfe: 0.224753 hartree
zpe.sumelectzpe: -1570.617827 hartree
zpe.sumelectthermal: -1570.600092 hartree
zpe.sumelectthermalent: -1570.599148 hartree
zpe.sumelectthermalfe: -1570.664920 hartree
dipole: 9.7187 2.9060 1.1245
dipole: 10.2060
quadrupole: -100.7274 -123.0045 -124.8543
quadrupole: 14.6131 0.3651 -1.5645
quadrupole: 15.4680 -6.8091 -8.6589 14.6131 0.3651 -1.5645
hfenergy: -1570.8896729 hartree
pointgroup: C01 [X(C12H16Cl1N1O4Si1)]
dipole: 3.922936 -0.7971402 -0.3134876 debye
polarizability: 218.057793|8.0779059|164.0517066|-4.2685057|-28.2918205|137.2915051 unknown
InChI: InChI=1S/C12H16ClNO4Si/c13-11-2-1-3-12(10-11)18-19-15-7-4-14(5-8-16-19)6-9-17-19/h1-3,10H,4-9H2
charge 0 multiplicity 1
35 atoms
Cl -3.987585 -2.3337 1.767123
Si 0.874499 0.495564 -0.137189
O  0.760513 -0.521486 -1.556612
O  0.751772 -0.305491 1.418339
O  1.763642 1.991289 -0.231204
O  -0.688797 1.229809 -0.226753
N  3.004307 -0.400974 -0.059846
C  3.133498 -1.095181 -1.378015
C  2.960897 -1.311413 1.125745
C  3.877012 0.802154 0.102816
C  1.723209 -1.58657 -1.782452
C  1.952344 -0.710742 2.132679
C  3.167326 1.981343 -0.604037
C  -1.975433 0.754787 -0.051509
C  -2.266177 -0.426418 0.683933
C  -3.027617 1.520603 -0.615402
C  -3.611416 -0.807222 0.817213
C  -4.363717 1.102647 -0.451397
C  -4.68065 -0.076018 0.267764
H  3.866814 -1.92488 -1.337085
H  3.482507 -0.352779 -2.116828
H  3.963812 -1.450773 1.575987
H  2.589227 -2.293467 0.785247
H  4.896581 0.630718 -0.295955
H  3.953249 1.021444 1.182108
H  1.692185 -1.843039 -2.854945
H  1.43347 -2.486218 -1.200708
H  1.65757 -1.460164 2.886239
H  2.387141 0.163446 2.65933
H  3.600709 2.944858 -0.287327
H  3.265855 1.899641 -1.706615
H  -1.458191 -0.994552 1.152079
H  -2.771675 2.426647 -1.171406
H  -5.174101 1.695669 -0.889421
H  -5.714482 -0.406635 0.396007
