program: Gaussian 09
title: 000100717
version: EM64L-G09RevD.01
frameworkgroup: C1[X(C11H14N4O4)]
method: RPBEPBE
basis: SDD
operation: Freq
keyword: #p
keyword: freq=noraman
keyword: PBEPBE/SDD
title: #p freq=noraman PBEPBE/SDD
converged: YES YES NO NO
title: Mulliken charges:
elementType: O O O O N N N N C C C C C C C C C C C H H H H H H H H H H H H H H
charge: -0.308233 -0.463942 -0.448810 -0.437133 -0.459863 -0.028648 -0.057214 -0.635164 -0.176745 -0.223161 -0.147879 0.000735 0.408551 -0.371913 -0.512352 0.067611 0.080763 0.133646 -0.418361 0.261703 0.245780 0.226534 0.277502 0.194053 0.202552 0.343722 0.267020 0.374987 0.372966 0.348127 0.238620 0.308521 0.336026
chargesum: 0.00000
title: Mulliken charges with hydrogens summed into heavy atoms:
elementType: O O O O N N N N C C C C C C C C C C C
charge: -0.308233 -0.088955 -0.075844 -0.089006 -0.116141 -0.028648 -0.057214 0.009383 0.084959 0.022618 0.078655 0.278238 0.408551 0.024692 -0.245333 0.067611 0.080763 0.133646 -0.179741
polarizability: 2.19875185e+02 2.43188784e+00 1.76548008e+02 6.52670449e+00 7.88933460e+00 9.06737815e+01
1716.lowfreq: -9.8199 -3.2591 -0.0005 0.0001 0.0003 5.0197 12.2411 34.2542 51.9645
frequency: 12.0582 34.2463 51.9585 64.6000 98.9711 128.4384 149.0474 163.1228 166.7452 227.5241 246.4103 256.1792 279.7867 293.7121 300.2623 306.9579 313.9545 329.6969 357.6465 397.2140 454.0567 501.0408 504.1790 520.7255 529.4133 566.1543 568.7610 586.6172 609.3965 633.7215 640.7247 664.7781 673.2708 717.3532 777.6498 815.3386 819.6266 833.9168 856.8671 880.3980 930.7305 957.3570 961.5655 969.8307 980.4046 1000.5257 1019.9258 1028.0726 1042.7947 1063.4927 1097.5991 1100.2276 1131.1999 1161.6471 1202.0718 1203.0430 1206.5025 1229.7482 1238.1155 1247.3533 1262.9827 1278.9236 1309.2431 1312.5153 1321.7241 1332.4681 1342.9911 1355.6836 1357.6146 1376.5635 1392.4310 1418.2948 1419.5821 1432.0467 1459.0078 1519.9131 1563.8647 1598.4824 1630.1276 2930.8600 2976.3038 2987.5666 2991.5503 3006.8283 3054.9836 3156.4972 3222.7514 3504.0338 3547.3570 3562.8614 3572.0787 3577.4596 3704.0426
redmass: 5.7114 6.0844 5.8506 6.3491 3.7978 5.3551 3.6688 5.7274 4.8852 1.1477 3.7212 4.8851 4.9549 1.9228 1.4329 3.0922 1.9372 3.6771 5.7527 4.2629 1.3259 3.7697 2.8214 1.1875 4.5565 4.8750 4.2961 6.3399 5.3194 1.2344 8.0668 3.4446 4.2161 4.7015 2.9853 3.4318 2.1410 3.9493 7.1614 3.3924 1.4186 2.4237 3.9926 6.0747 2.9599 2.6761 3.9896 4.1972 3.3440 2.7109 2.1208 4.7767 1.5248 1.1709 1.7005 1.1357 1.2438 1.2886 1.2453 2.0173 1.2661 1.4078 5.6884 1.3175 1.2173 1.7824 2.1762 2.9672 1.5006 1.6077 3.7319 2.8474 1.9774 2.5981 1.0795 6.8473 5.8447 1.9748 2.4173 1.0553 1.0871 1.1022 1.0840 1.0873 1.0871 1.0916 1.0985 1.0648 1.0459 1.0801 1.0667 1.0666 1.1039
irintensity: 0.8199 1.1606 5.0084 1.3600 9.2244 17.9437 7.3787 4.0877 3.9991 128.7900 24.5224 9.4394 6.2920 38.4879 82.6546 4.9654 208.4672 12.2090 5.4068 1.0100 134.7256 12.3411 18.6897 142.4484 9.5277 8.2494 24.3357 2.5870 44.4900 52.3300 14.9372 49.4250 4.0004 2.0612 4.3240 43.2090 36.0651 9.9420 6.4412 7.6557 14.4753 8.8571 93.0091 80.1205 18.3960 47.6884 49.2140 26.4118 105.4861 18.8219 23.1751 5.4686 15.6944 12.4750 14.0766 20.1873 45.4269 7.6036 13.4203 37.4222 10.0300 14.5374 22.8058 81.6281 16.8784 18.6174 52.9922 27.2501 32.1755 24.5469 40.5720 59.9919 16.4990 16.3658 6.7750 106.3068 44.4515 25.7612 447.9206 49.9333 29.8089 60.3947 8.8688 64.8447 29.1281 27.4057 2.3679 29.8096 79.0658 105.6256 4.8424 16.1434 30.7641
temp: 298.150 k
press: 1.00000 atm
elementType: 8 8 8 8 7 7 7 7 6 6 6 6 6 6 6 6 6 6 6 1 1 1 1 1 1 1 1 1 1 1 1 1 1
symmnumber: 1
zpe: 667422.7 jmol-1
zpe.correction: 0.254208 hartree
zpe.thermalcorrener: 0.271978 hartree
zpe.thermalcorrenthalpy: 0.272922 hartree
zpe.thermalcorrgfe: 0.207074 hartree
zpe.sumelectzpe: -946.028684 hartree
zpe.sumelectthermal: -946.010913 hartree
zpe.sumelectthermalent: -946.009969 hartree
zpe.sumelectthermalfe: -946.075818 hartree
dipole: -4.0945 3.9023 3.6858
dipole: 6.7512
quadrupole: -131.1951 -93.9165 -113.8983
quadrupole: 4.3360 -9.8808 6.2491
quadrupole: -18.1918 19.0868 -0.8950 4.3360 -9.8808 6.2491
hfenergy: -946.2828914 hartree
pointgroup: C01 [X(C11H14N4O4)]
dipole: -1.5938823 1.9940366 -0.7337071 debye
polarizability: 220.0215212|5.3655044|113.1397742|-0.3348519|-38.6876251|153.9356789 unknown
InChI: InChI=1S/C11H14N4O4/c12-11-7-4(13-3-14-11)1-5(15-7)10-9(18)8(17)6(2-16)19-10/h1,3,6,8-10,15-18H,2,12H2
charge 0 multiplicity 1
33 atoms
O  -1.814091 -0.60368 -0.768286
O  -2.191874 -0.597199 2.896192
O  -4.256457 -1.22457 1.318004
O  -3.19602 0.941608 -2.767605
N  0.795605 -0.181735 -0.427782
N  3.660277 -1.111789 1.553652
N  4.536428 0.214566 -0.318546
N  3.208495 1.12544 -2.025276
C  -1.328714 -1.052405 0.556138
C  -2.071929 -0.096442 1.53361
C  -3.491147 -0.04778 0.914408
C  -3.231204 -0.140505 -0.60979
C  0.165398 -0.936365 0.564766
C  -3.411973 1.188699 -1.338448
C  1.119684 -1.413426 1.470392
C  2.171526 -0.173891 -0.183978
C  2.40145 -0.931738 1.016283
C  3.289805 0.3925 -0.855625
C  4.648398 -0.514748 0.841033
H  -1.652449 -2.090636 0.770539
H  -1.596776 0.904797 1.50883
H  -4.028328 0.878417 1.202915
H  -3.896365 -0.9056 -1.047811
H  -2.689978 1.93945 -0.948087
H  -4.446118 1.548026 -1.144624
H  0.265306 0.176616 -1.223579
H  0.945837 -2.058601 2.329425
H  -1.297554 -0.654312 3.316385
H  -4.046645 -1.394919 2.276026
H  -3.435998 1.752554 -3.282152
H  5.667076 -0.622762 1.227115
H  2.339693 1.258893 -2.533438
H  4.082343 1.468241 -2.420284
