program: Gaussian 09
title: 000100695
version: EM64L-G09RevD.01
frameworkgroup: C1[X(C8H10N8O)]
method: RPBEPBE
basis: SDD
operation: Freq
keyword: #p
keyword: freq=noraman
keyword: PBEPBE/SDD
title: #p freq=noraman PBEPBE/SDD
converged: YES YES NO NO
title: Mulliken charges:
elementType: O N N N N N N N N C C C C C C C C H H H H H H H H H H
charge: -0.339017 -0.252870 -0.050387 -0.619541 -0.192244 -0.137992 -0.367506 -0.634499 -0.566530 0.280494 -0.002387 0.259738 -0.390887 -0.287277 0.215460 -0.260657 0.192396 0.246948 0.296069 0.280728 0.368948 0.392253 0.312896 0.313191 0.330171 0.306471 0.306032
chargesum: 0.00000
title: Mulliken charges with hydrogens summed into heavy atoms:
elementType: O N N N N N N N N C C C C C C C C
charge: -0.339017 -0.252870 -0.050387 0.141659 -0.192244 -0.137992 -0.054610 0.008863 0.045973 0.280494 -0.002387 0.259738 -0.143939 0.008792 0.215460 0.020071 0.192396
polarizability: 2.78571754e+02 -5.16643999e+00 1.47242873e+02 -1.97869358e-02 2.01065314e-02 6.34354053e+01
1716.lowfreq: -0.0005 0.0004 0.0008 2.9065 3.9530 15.0757 36.9536 64.7138 80.3131
frequency: 36.9331 64.7131 80.3027 93.2560 100.6072 133.1033 181.5510 222.1138 225.1221 276.7655 281.7291 318.0450 322.0818 376.8766 385.6042 414.3640 450.0775 453.1063 487.0800 526.4484 537.0997 538.8041 550.2070 606.1943 618.2853 634.9031 647.5844 670.0673 703.9032 704.6923 728.7472 740.0355 754.7159 786.2210 822.0624 840.9990 863.3256 916.5019 970.2205 998.3557 1013.8822 1036.2137 1080.8983 1104.1561 1152.3856 1171.0592 1212.5626 1221.3547 1234.2987 1264.1042 1297.5685 1305.7443 1361.3087 1380.3073 1416.7297 1454.5875 1456.9645 1494.0982 1529.4647 1543.5071 1575.8703 1596.6633 1614.1201 1641.4288 1670.7462 3177.4882 3197.3359 3198.4922 3355.9885 3455.3046 3467.1263 3520.4860 3533.6523 3586.9777 3690.2487
redmass: 5.5956 4.7746 4.1861 6.0224 5.0590 7.8456 5.4899 6.5212 4.4056 5.5792 5.1658 1.3939 3.4689 2.5234 5.0153 8.0565 1.2391 8.8731 1.3616 1.2831 2.7625 5.5648 3.5900 1.0988 4.7121 7.3874 6.3348 8.1876 1.1903 4.9601 6.7969 2.2714 3.7368 1.6184 6.3637 1.4523 1.5073 4.1428 4.6737 1.3002 4.5459 2.1066 3.1762 1.4830 2.2161 3.6210 1.6631 5.2213 1.1738 3.0316 2.0076 6.3387 4.0571 3.5620 4.5077 2.6941 2.5246 1.9911 2.7830 5.0074 3.5044 5.2864 1.4404 7.2984 1.1784 1.0898 1.0967 1.0984 1.0436 1.0445 1.0717 1.1095 1.0445 1.1059 1.1045
irintensity: 6.1359 0.4481 0.1956 2.1165 12.9623 0.0541 4.6030 0.2102 30.6505 18.9004 0.7729 71.4351 0.6028 24.8595 1.3279 2.3396 168.5701 1.4713 243.7534 100.8525 7.1384 36.0705 4.0274 70.0040 0.2392 1.5382 20.7719 10.8656 203.3378 66.9496 9.2968 39.9536 64.4022 13.9962 1.1282 13.4991 51.2228 55.7504 37.5731 0.0114 8.9792 18.6562 2.2055 22.5832 34.1377 7.5589 27.9903 55.5098 0.7978 2.7423 5.7903 17.3737 88.9066 294.3694 99.9931 65.8959 45.2922 238.4320 191.3944 474.4165 340.3295 43.0736 77.5806 384.7573 45.9130 0.9989 4.5624 0.4539 65.1755 1.5000 47.5033 317.1891 56.0503 5.1470 26.9667
temp: 298.150 k
press: 1.00000 atm
elementType: 8 7 7 7 7 7 7 7 7 6 6 6 6 6 6 6 6 1 1 1 1 1 1 1 1 1 1
symmnumber: 1
zpe: 526811.1 jmol-1
zpe.correction: 0.200652 hartree
zpe.thermalcorrener: 0.215842 hartree
zpe.thermalcorrenthalpy: 0.216786 hartree
zpe.thermalcorrgfe: 0.158187 hartree
zpe.sumelectzpe: -822.818854 hartree
zpe.sumelectthermal: -822.803663 hartree
zpe.sumelectthermalent: -822.802719 hartree
zpe.sumelectthermalfe: -822.861319 hartree
dipole: 5.0860 2.9086 0.0269
dipole: 5.8590
quadrupole: -47.1272 -100.0763 -101.0064
quadrupole: -14.0805 0.1143 -0.0048
quadrupole: 35.6094 -17.3396 -18.2698 -14.0805 0.1143 -0.0048
hfenergy: -823.0195055 hartree
pointgroup: C01[X(C8H10N8O1)]
dipole: -2.0017131 1.1426344 -0.0327861 debye
polarizability: 278.5100552|5.2706827|147.2472238|3.3626008|0.7149542|63.4927531 unknown
InChI: InChI=1S/C8H10N8O/c9-7-4(8(10)17)3-12-16(7)6-2-1-5(13-11)14-15-6/h1-3,13H,9-11H2
charge 0 multiplicity 1
27 atoms
O  4.218666 -1.630674 0.021692
N  0.562609 0.513187 -0.016499
N  1.059149 1.853886 0.001942
N  1.419108 -1.77336 -0.022002
N  -1.229194 -1.019786 -0.056414
N  -2.562129 -1.326925 -0.079441
N  -4.804815 -0.72891 -0.105987
N  5.25218 0.447641 0.052761
N  -5.86631 0.177756 -0.126645
C  1.594338 -0.428681 -0.00851
C  2.811369 0.31514 0.015907
C  -0.829626 0.288379 -0.039939
C  2.40306 1.691306 0.021068
C  -1.746975 1.379926 -0.045766
C  4.114859 -0.34806 0.029991
C  -3.106762 1.078041 -0.068569
C  -3.481699 -0.302441 -0.084592
H  3.027216 2.58556 0.038094
H  -1.36224 2.401215 -0.032466
H  -3.884231 1.844866 -0.074723
H  2.287116 -2.322962 -0.012714
H  0.45623 -2.133128 -0.039444
H  -4.951415 -1.744461 -0.119937
H  5.210007 1.463873 0.059138
H  6.158007 -0.017778 0.06261
H  -6.427184 0.217786 0.727718
H  -6.386035 0.228305 -1.006373
