program: Gaussian 09
title: 000100681
version: EM64L-G09RevD.01
frameworkgroup: C1[X(C18H16N2O6)]
method: RPBEPBE
basis: SDD
operation: Freq
keyword: #p
keyword: freq=noraman
keyword: PBEPBE/SDD
title: #p freq=noraman PBEPBE/SDD
converged: YES YES NO NO
title: Mulliken charges:
elementType: O O O O O O N N C C C C C C C C C C C C C C C C C C H H H H H H H H H H H H H H H H
charge: -0.199439 -0.183468 -0.183408 -0.192156 -0.178328 -0.176430 -0.125799 -0.343174 -0.570017 -0.394368 0.513409 -0.524191 -0.500735 -0.499848 0.216561 0.213132 0.494559 -0.406217 -0.419462 0.292240 -0.361153 -0.360040 0.152194 0.151743 -0.253958 -0.253448 0.241248 0.207560 0.239058 0.232844 0.270029 0.254340 0.271138 0.269711 0.269955 0.270568 0.245743 0.235100 0.265328 0.264128 0.277440 0.277610
chargesum: 0.00000
title: Mulliken charges with hydrogens summed into heavy atoms:
elementType: O O O O O O N N C C C C C C C C C C C C C C C C C C
charge: -0.199439 -0.183468 -0.183408 -0.192156 -0.178328 -0.176430 -0.125799 -0.343174 -0.121209 0.077533 0.513409 0.000178 0.040114 0.040675 0.216561 0.213132 0.494559 -0.160473 -0.184362 0.292240 -0.095825 -0.095912 0.152194 0.151743 0.023482 0.024162
polarizability: 3.11623600e+02 5.67282989e+00 2.18066844e+02 -4.06698576e-01 -8.81109308e+00 1.51939084e+02
1716.lowfreq: -11.2450 -2.5423 -0.0010 -0.0007 0.0007 2.5553 7.2437 11.5173 14.0100
frequency: 4.7528 10.9521 13.8486 32.3755 37.1036 41.6591 50.8309 65.3742 75.4093 85.8811 95.9808 106.9097 113.4757 158.1132 202.4137 205.5305 243.2339 270.2828 282.5765 297.0675 298.7589 316.8890 354.5581 370.9601 402.4492 406.4072 414.2552 456.2929 519.1568 528.9632 535.7163 548.8254 552.3545 569.8813 580.8884 601.0778 623.2486 634.3122 636.4589 639.1952 665.8994 684.9971 712.7675 733.9389 737.9892 754.9483 792.6930 813.8973 818.2778 822.0510 835.5081 844.2299 866.7330 940.8720 941.3318 951.1907 970.9563 975.8896 989.5629 997.9043 1005.5520 1014.2846 1014.6129 1017.5077 1032.7216 1046.9929 1057.3001 1074.5358 1094.3526 1130.5276 1146.6849 1163.6475 1168.0302 1189.8405 1199.2476 1204.5557 1209.2555 1223.3711 1229.6506 1277.6690 1286.3567 1292.6782 1293.4917 1298.9348 1322.1270 1342.1002 1348.9006 1350.6417 1381.1281 1417.6725 1436.3199 1436.9969 1452.1819 1460.3713 1479.7894 1510.5734 1584.1438 1591.1456 1622.4791 1623.3699 1663.0986 1675.2034 1702.3304 1731.0224 2985.2949 2992.9899 3007.1128 3029.6285 3037.2002 3038.5096 3059.1760 3074.4147 3084.3061 3101.4199 3126.4607 3131.2096 3181.1367 3184.4794 3206.1343 3234.6921
redmass: 7.6599 6.9540 6.1540 7.1911 5.1676 5.2954 4.3624 2.8679 2.9956 6.5035 5.2294 7.6702 6.9504 6.3717 2.7109 5.6052 4.0822 6.2744 4.2492 3.8109 9.8787 6.3411 6.1267 4.1145 4.8782 3.0754 6.3764 5.9611 3.4217 3.2072 3.4953 2.8501 4.2317 3.8326 8.6136 6.8176 2.6657 6.1867 5.0856 4.2653 4.7629 7.7892 5.0779 6.4128 4.3177 2.1464 3.1787 2.1923 1.5262 2.0406 1.3050 1.8129 2.2114 5.5541 1.3740 1.4435 1.3761 3.1626 3.8785 4.2480 2.1822 3.0265 2.9969 3.9150 3.0919 3.0812 1.2386 2.2270 4.5812 1.4790 1.1954 1.2751 8.3922 1.8475 1.2599 1.5691 1.1107 2.4434 2.9635 1.2462 1.7212 2.1473 1.5518 1.3735 1.2801 1.4740 1.5359 5.3541 6.0649 2.9331 1.0743 1.0871 1.0899 1.0808 1.1026 2.6919 7.0224 7.0040 11.2000 6.4294 12.6326 11.4441 11.8690 11.6368 1.0596 1.0628 1.0612 1.0593 1.1009 1.0630 1.0986 1.1020 1.1037 1.1019 1.0903 1.0907 1.0941 1.0950 1.0894 1.1110
irintensity: 0.1080 0.1640 0.1235 0.1150 0.0801 1.6415 1.1433 3.0441 3.3343 5.9899 7.5592 1.9138 7.9871 2.1361 1.5352 1.1902 1.3506 21.3612 0.4227 0.5444 1.1226 1.8738 13.7927 0.5548 2.6218 0.4328 3.8484 5.8653 6.4092 8.0294 0.9054 3.3743 2.7665 6.7356 11.1314 11.5208 5.8714 55.9321 4.0202 11.7783 2.9015 47.7168 3.1678 2.8875 1.9726 30.1345 31.0003 51.2850 30.6478 52.3861 11.0760 55.7788 4.0240 12.3100 1.2444 12.5296 0.1468 114.4545 170.2042 23.1248 0.9408 29.7251 14.3420 27.0182 19.1960 10.0313 29.0021 20.3911 58.4221 21.1059 0.9395 51.3934 218.0061 24.8598 1.6148 12.2824 0.0222 2.4898 66.8540 6.7211 1.5093 38.2080 7.0385 11.0936 0.7334 48.2812 35.6572 321.6775 0.7045 11.5691 2.7946 28.0124 27.4184 4.8974 12.2732 155.6515 18.0872 13.9074 382.6383 9.0033 582.9314 3.1647 79.5194 45.2786 15.3752 26.0721 23.6341 11.2883 3.6217 1.7102 4.8599 24.4463 0.0076 5.7142 15.5780 14.3186 2.3343 0.9631 0.0067 0.9947
temp: 298.150 k
press: 1.00000 atm
elementType: 8 8 8 8 8 8 7 7 6 6 6 6 6 6 6 6 6 6 6 6 6 6 6 6 6 6 1 1 1 1 1 1 1 1 1 1 1 1 1 1 1 1
symmnumber: 1
zpe: 816532.8 jmol-1
zpe.correction: 0.311001 hartree
zpe.thermalcorrener: 0.334916 hartree
zpe.thermalcorrenthalpy: 0.335860 hartree
zpe.thermalcorrgfe: 0.250029 hartree
zpe.sumelectzpe: -1254.483052 hartree
zpe.sumelectthermal: -1254.459137 hartree
zpe.sumelectthermalent: -1254.458193 hartree
zpe.sumelectthermalfe: -1254.544024 hartree
dipole: 0.2140 0.6951 -0.1154
dipole: 0.7364
quadrupole: -100.6806 -152.9677 -157.8445
quadrupole: 11.3368 7.0677 -9.4654
quadrupole: 36.4837 -15.8034 -20.6802 11.3368 7.0677 -9.4654
hfenergy: -1254.7940529 hartree
pointgroup: C01 [X(C18H16N2O6)]
dipole: 0.0808181 -0.2725727 0.0558677 debye
polarizability: 311.4665142|-6.8518675|217.4441862|0.3472121|-11.3429278|152.7188268 unknown
InChI: InChI=1S/C18H16N2O6/c21-14-8-9-15(22)19(14)13-6-4-12(5-7-13)2-1-3-18(25)26-20-16(23)10-11-17(20)24/h4-9H,1-3,10-11H2
charge 0 multiplicity 1
42 atoms
O  4.609817 1.023198 -0.394673
O  4.717754 -1.444812 -1.910629
O  6.589329 0.904052 1.721685
O  3.150248 -0.145866 1.05381
O  -6.084596 2.00196 0.028023
O  -5.204671 -2.624388 0.376788
N  5.527311 -0.042979 -0.176479
N  -5.215088 -0.234956 0.128003
C  0.425819 0.792906 -0.803566
C  0.989469 1.75455 0.280081
C  -1.051537 0.505175 -0.588423
C  2.492809 2.057841 0.093052
C  6.641077 -2.09722 -0.429601
C  7.261977 -1.320143 0.763607
C  5.508705 -1.220049 -0.974556
C  6.469887 -0.014211 0.888009
C  -3.816808 0.013943 -0.111636
C  -1.468691 -0.513951 0.305333
C  -2.051827 1.270243 -1.239083
C  3.360904 0.847233 0.351162
C  -2.833948 -0.760148 0.552821
C  -3.423034 1.030249 -1.015513
C  -6.240818 0.766924 0.177719
C  -5.804299 -1.523764 0.355142
C  -7.531524 0.041794 0.451156
C  -7.277926 -1.288827 0.554632
H  1.000722 -0.15212 -0.777251
H  0.585275 1.243494 -1.802391
H  0.825016 1.314364 1.28086
H  0.431393 2.708982 0.250769
H  2.817841 2.841183 0.807167
H  2.712451 2.446202 -0.917545
H  6.215152 -3.070133 -0.131844
H  7.36306 -2.291307 -1.240954
H  8.327083 -1.076026 0.61101
H  7.185301 -1.867041 1.718309
H  -0.714247 -1.125799 0.814226
H  -1.757181 2.059155 -1.941719
H  -3.132813 -1.556414 1.238499
H  -4.177189 1.63172 -1.528317
H  -8.476089 0.578303 0.54011
H  -7.963512 -2.114516 0.74481
