program: Gaussian 09
title: 000100667
version: EM64L-G09RevD.01
frameworkgroup: C1[X(C8H6BrNO4)]
method: RPBEPBE
basis: SDD
operation: Freq
keyword: #p
keyword: freq=noraman
keyword: PBEPBE/SDD
title: #p freq=noraman PBEPBE/SDD
converged: YES YES NO NO
title: Mulliken charges:
elementType: Br O O O O N C C C C C C C C H H H H H H
charge: 0.058470 -0.286610 -0.171411 -0.203182 -0.206269 0.024663 0.369969 0.382946 -0.275327 -0.360965 -0.343687 -0.327330 0.329537 -0.782651 0.311565 0.269761 0.291839 0.293595 0.311228 0.313858
chargesum: 0.00000
title: Mulliken charges with hydrogens summed into heavy atoms:
elementType: Br O O O O N C C C C C C C C
charge: 0.058470 -0.286610 -0.171411 -0.203182 -0.206269 0.024663 0.369969 0.382946 0.036238 -0.091204 -0.051848 -0.033734 0.329537 -0.157565
polarizability: 2.22435675e+02 7.55036642e+00 1.19467560e+02 -2.31707147e-01 9.99051852e-01 4.99181254e+01
1716.lowfreq: -6.3797 -5.4965 -0.0010 -0.0009 -0.0009 1.7349 12.1012 32.6264 45.1263
frequency: 4.1639 32.6179 45.0900 68.4959 75.9850 137.3915 162.0387 198.5105 249.9881 311.9200 333.6179 390.6137 415.5982 494.0813 505.6384 525.6339 576.3560 612.9266 664.2019 675.5061 689.1535 732.9368 750.1078 799.7815 843.6247 873.3307 875.4612 891.8635 987.4328 1000.5232 1001.2004 1057.8381 1093.5943 1111.4175 1145.3634 1152.9583 1191.8456 1221.4922 1255.3897 1291.9138 1364.4362 1402.0447 1416.7922 1423.3621 1468.9405 1591.4113 1607.3867 1682.9089 3054.6379 3141.5885 3171.9613 3181.6944 3192.1836 3216.1054
redmass: 8.0678 7.1493 5.8338 7.3137 7.4227 7.8838 14.3568 8.4712 10.5195 6.9827 6.7663 10.3056 3.0040 3.2007 7.3913 3.1545 8.4104 7.1062 4.7517 7.2574 7.0385 4.8729 8.3320 8.5878 1.2696 1.6414 1.6274 7.2457 1.3328 3.0862 1.3338 3.6614 3.1005 1.2679 1.1933 2.0420 1.9776 6.4748 1.3982 1.2734 8.2456 11.0967 1.1280 3.5271 2.3451 7.2764 7.2048 11.0966 1.0590 1.1051 1.0896 1.0914 1.0970 1.0954
irintensity: 1.1989 3.9378 0.4919 0.0463 1.3240 6.2623 0.6129 2.4908 4.3166 0.2680 0.4897 7.9065 0.0248 9.8571 1.7602 0.3349 7.0160 3.7555 22.5412 4.1226 50.3205 7.2151 3.8449 19.9117 5.4789 75.0228 22.0787 92.4337 0.5093 7.4603 0.0308 743.6073 27.5495 26.1488 109.4224 238.9668 50.7764 306.9416 21.9213 2.5622 85.4132 18.3074 50.4610 36.1824 75.2904 63.2190 60.1482 142.3216 12.8772 0.2128 0.6290 2.0079 3.1552 4.3497
temp: 298.150 k
press: 1.00000 atm
elementType: 35 8 8 8 8 7 6 6 6 6 6 6 6 6 1 1 1 1 1 1
symmnumber: 1
zpe: 343107.3 jmol-1
zpe.correction: 0.130683 hartree
zpe.thermalcorrener: 0.143678 hartree
zpe.thermalcorrenthalpy: 0.144622 hartree
zpe.thermalcorrgfe: 0.085628 hartree
zpe.sumelectzpe: -676.456418 hartree
zpe.sumelectthermal: -676.443422 hartree
zpe.sumelectthermalent: -676.442478 hartree
zpe.sumelectthermalfe: -676.501472 hartree
dipole: -3.5356 3.1329 0.5954
dipole: 4.7613
quadrupole: -127.9672 -85.9383 -88.4539
quadrupole: -1.6979 -0.5544 1.0299
quadrupole: -27.1807 14.8482 12.3326 -1.6979 -0.5544 1.0299
hfenergy: -676.5871002 hartree
pointgroup: C01 [X(C8H6Br1N1O4)]
dipole: 1.5040483 -1.083323 -0.2706154 debye
dipolederiv: -0.3125292 -0.0699568 0.0244453 -0.156189 -0.1097897 0.0271208 0.0526405 0.0159523 -0.0725446 -2.711153 -0.4725926 -0.0370833 -0.6169238 -0.5176237 -0.1218724 -0.1286811 -0.1248991 -0.2335687 -0.6894933 0.0871046 0.0656741 -0.4358088 -0.7510299 -0.2039459 -0.2044401 -0.2128713 -0.353417 -0.7465139 0.1611989 0.0916065 0.2396414 -0.6153087 -0.1647127 0.1203345 -0.1598106 -0.2960468 -0.8174501 -0.2065882 -0.0480765 -0.2370517 -0.5967488 -0.130365 -0.0618355 -0.1322355 -0.277809 2.0009517 0.036006 -0.0846871 -0.0409762 0.9701943 0.3043541 -0.1103506 0.299312 0.3190467 1.731305 0.161883 -0.0331718 -0.157704 0.1977412 0.0324296 -0.1801248 0.0103156 0.1362185 -0.8421682 -0.0133265 0.0435165 0.050024 0.0047046 -0.0192365 0.0649961 -0.0164016 0.0379085 -0.4953969 0.0867167 0.056029 0.277385 -0.1045113 -0.002944 0.1173333 0.0066728 -0.1380005 -0.5312893 -0.157819 -0.0398292 -0.2395054 -0.0156285 0.0662888 -0.0819187 0.0623962 -0.1254785 0.2698206 -0.0698615 -0.0480561 0.1748938 0.0011941 0.0267268 0.0551462 0.0428807 -0.082163 0.2737357 0.0790448 0.0109335 -0.2116839 -0.0234321 0.0413468 -0.0974896 0.0259658 -0.0816992 2.3024268 0.2468187 0.0095841 0.8455247 1.0560574 0.3831671 0.4679756 0.3702737 0.3733164 0.19911 0.3031627 -0.0342003 0.6514191 0.1320276 -0.1024183 -0.0950876 -0.0570167 0.0654165 0.1440431 -0.0343653 -0.0122107 -0.0326299 0.0925271 -0.031049 -0.0079761 -0.0330647 0.1688832 0.0704819 0.0571178 0.0268519 0.0641565 0.040266 -0.0544969 0.0288948 -0.0544033 0.1487733 0.1008629 0.0403112 0.0195889 0.0134896 0.0793195 -0.0360149 0.0095185 -0.0376086 0.1560012 0.0938943 -0.0592896 -0.018937 -0.0197607 0.0869873 -0.032797 -0.0026907 -0.0306778 0.1614322 -0.0113133 -0.1043132 -0.0274245 -0.0976473 0.0372634 -0.0583146 0.0193686 -0.0467182 0.0473055 -0.0293248 -0.0712517 0.0354465 -0.0706534 0.0357902 0.0767331 0.0343867 0.0719384 0.0464251 unknown
polarizability: 219.3198798|19.6486293|114.9438514|-7.6181363|20.5387156|57.5576291 unknown
InChI: InChI=1S/C8H6BrNO4/c9-5-8(11)14-7-3-1-6(2-4-7)10(12)13/h1-4H,5H2
charge 0 multiplicity 1
20 atoms
Br 5.802916 1.020289 -0.559887
O  1.928153 -0.427228 -0.453243
O  2.784599 1.61097 0.385393
O  -4.222267 1.149733 0.483749
O  -4.407446 -0.972918 -0.33399
N  -3.712919 0.053606 0.029994
C  0.533144 -0.196085 -0.284622
C  -2.237121 -0.034211 -0.080552
C  -0.047851 0.998778 0.209011
C  -0.259971 -1.301819 -0.675416
C  -1.451598 1.070754 0.309106
C  -1.658093 -1.225199 -0.574551
C  2.956866 0.479525 -0.087787
C  4.270011 -0.241638 -0.359936
H  0.574081 1.84338 0.504681
H  0.233654 -2.201804 -1.05179
H  -1.942565 1.972265 0.684641
H  -2.302055 -2.058112 -0.866771
H  4.202308 -0.836802 -1.280968
H  4.513953 -0.900984 0.489138
