program: Gaussian 09
title: 000100650
version: EM64L-G09RevD.01
frameworkgroup: C1[X(C13H7NO2)]
method: RPBEPBE
basis: SDD
operation: Freq
keyword: #p
keyword: freq=noraman
keyword: PBEPBE/SDD
title: #p freq=noraman PBEPBE/SDD
converged: NO YES NO YES
title: Mulliken charges:
elementType: O O N C C C C C C C C C C C C C H H H H H H H
charge: -0.181160 -0.182947 0.012096 0.273246 0.264856 0.335774 0.229777 -0.207904 -0.196384 -0.363065 -0.362887 -0.297954 -0.452640 -0.224515 -0.221665 -0.337756 0.291165 0.291964 0.286194 0.299897 0.244432 0.244475 0.255002
chargesum: 0.00000
title: Mulliken charges with hydrogens summed into heavy atoms:
elementType: O O N C C C C C C C C C C C C C
charge: -0.181160 -0.182947 0.012096 0.273246 0.264856 0.335774 0.229777 -0.207904 -0.196384 -0.071900 -0.070923 -0.011760 -0.152743 0.019917 0.022810 -0.082754
polarizability: 2.30869943e+02 4.31528895e+00 1.71282380e+02 5.89248462e-03 -1.60070931e-02 5.62996629e+01
1716.lowfreq: -10.1602 -0.0008 -0.0002 0.0008 2.3282 7.4978 50.9539 111.4960 128.0092
frequency: 50.9537 111.4957 128.0090 157.0142 220.0211 227.1836 282.9966 354.7141 367.7472 369.5926 413.3629 416.5623 432.0246 468.5947 499.4320 602.4325 631.4901 667.4850 669.9523 692.1961 720.4273 739.8284 781.9314 803.0414 862.7129 880.4364 903.6538 924.3304 936.0495 971.1714 995.2568 1001.8301 1018.2200 1022.8356 1036.3655 1085.4454 1131.0419 1163.8545 1174.0043 1186.9005 1224.3394 1273.2240 1299.5195 1303.6757 1310.4426 1396.3822 1401.4364 1440.6065 1455.0789 1469.3707 1529.4133 1544.8006 1556.2939 1580.1259 1596.4695 1613.3034 3139.2748 3144.2538 3152.3080 3157.3784 3162.2270 3172.4213 3173.2102
redmass: 8.4727 4.1077 5.6013 7.9180 5.3760 5.2708 7.4385 7.8035 3.0878 12.2577 8.3891 5.3991 3.5046 12.2577 4.6261 7.3758 7.0890 7.6556 4.2899 6.7861 2.3784 3.9952 7.1828 1.5158 2.0194 1.6604 7.9790 6.8007 1.6136 1.7799 1.4539 1.4078 1.3780 2.4767 1.9132 2.5720 4.4618 1.8607 1.1876 2.0729 1.6470 1.6339 3.4167 4.9857 2.7413 5.6487 2.7215 2.5429 2.2461 2.6600 9.4873 8.7617 7.7437 6.8880 8.7216 7.3064 1.0864 1.0894 1.0900 1.0926 1.0948 1.0986 1.0988
irintensity: 4.8125 0.8637 0.4338 3.4466 0.2890 1.9003 0.4183 0.3429 0.8935 22.7983 0.6218 3.0064 0.0851 0.2224 2.9002 4.8012 8.2362 0.5761 3.4158 2.5597 87.2100 0.2756 2.3771 19.0719 9.5064 29.6193 21.6061 34.5892 1.3214 1.4360 0.4205 6.2019 0.0020 1.1051 1.4631 1.0206 2.0561 5.6718 6.3206 4.1571 0.9634 6.9870 568.5412 13.0074 17.5452 0.9723 3.7590 1.4337 9.8470 5.4058 1.4503 244.9662 0.3289 53.4563 3.4567 8.3301 3.2160 13.8856 2.5488 0.1222 1.1126 31.1218 3.7445
temp: 298.150 k
press: 1.00000 atm
elementType: 8 8 7 6 6 6 6 6 6 6 6 6 6 6 6 6 1 1 1 1 1 1 1
symmnumber: 1
zpe: 431840.9 jmol-1
zpe.correction: 0.164479 hartree
zpe.thermalcorrener: 0.175782 hartree
zpe.thermalcorrenthalpy: 0.176726 hartree
zpe.thermalcorrgfe: 0.126860 hartree
zpe.sumelectzpe: -703.722427 hartree
zpe.sumelectthermal: -703.711125 hartree
zpe.sumelectthermalent: -703.710181 hartree
zpe.sumelectthermalfe: -703.760047 hartree
dipole: -3.1278 1.3423 -0.0019
dipole: 3.4037
quadrupole: -77.7413 -100.7482 -92.7022
quadrupole: 7.1384 -0.0036 0.0011
quadrupole: 12.6559 -10.3510 -2.3050 7.1384 -0.0036 0.0011
hfenergy: -703.8869068 hartree
pointgroup: C01 [X(C13H7N1O2)]
dipole: 1.2333594 0.5215482 0.0007573 debye
dipolederiv: -0.6530672 0.0174032 -0.0000203 0.1165161 -0.8910029 -0.0004122 -0.0001229 0.000281 -0.2997014 -0.661558 -0.0097941 -0.0000205 -0.0438908 -0.896192 0.0001165 -0.0000722 -0.0003076 -0.3034103 -0.3226814 0.0412742 0.0000198 0.0157793 -0.3222835 -0.0000136 -0.0000906 -0.00005 -0.2514905 -0.5837814 0.2648227 0.0000122 0.4289336 -0.1302136 -0.0000069 0.0002057 0.0001219 0.0255749 -0.5534165 -0.2354647 -0.0000201 -0.4355431 -0.101134 0.0000302 0.0002293 -0.0002039 0.018525 -0.3360912 -0.2027352 -0.0000249 -0.3811707 0.0139024 -0.0000076 -0.0003409 0.0001218 0.0481229 -0.6338945 0.0949598 -0.000085 0.3167038 -0.2600701 -0.0000042 -0.0003466 -0.0002299 0.0555521 1.5970337 -0.089896 0.0000628 -0.144138 0.9306108 0.0002814 0.0002539 -0.0001523 0.1187232 1.6806634 0.0459472 0.0000874 0.0350426 0.9272464 -0.0000488 0.0001184 0.0003014 0.1409107 -0.1618047 -0.1576559 -0.0000297 0.1198821 0.0936561 0.0000502 0.0000588 0.0000052 -0.1002373 -0.1982016 0.1469957 0.0000365 -0.1172782 0.0974783 0.0000262 0.0000433 0.0000616 -0.1010634 -0.4365913 0.1613027 -0.0000608 -0.170949 0.0556091 0.0000161 -0.0001317 0.0000294 -0.0565653 0.1075063 0.0511578 0.0000313 0.0965935 0.2901948 0.0000458 0.0000592 0.000152 -0.0226333 0.1715586 0.151555 -0.0000453 0.0792816 -0.0598755 -0.0000176 -0.0000603 -0.000043 -0.135175 0.1822907 -0.1468729 -0.0000972 -0.0759798 -0.0340241 0.0000346 -0.0000951 0.0000616 -0.1319482 0.4689628 -0.2189601 0.0001175 0.0405494 0.1144806 0.0000266 0.0002471 -0.0000379 -0.0569305 0.125738 0.0339413 0.0000144 -0.0318809 0.0049661 -0.0000262 0.0000287 -0.0000163 0.1560287 0.1313462 -0.0368404 0.0000014 0.0301728 0.0074303 -0.0000269 -0.0000095 -0.0000417 0.1560767 0.1379908 -0.0370266 -0.0000116 0.0339473 0.0073739 -0.0000217 -0.0000465 -0.000026 0.1536328 0.1244257 0.0307764 -0.0000034 0.0066353 0.0084572 -0.0000156 0.0000491 -0.0000397 0.1344154 -0.0688497 -0.0725676 0.0000214 -0.0866031 0.0532501 0.0000025 0.0000287 0.0000241 0.1576398 -0.0669061 0.075261 0.0000448 0.0877969 0.0509765 -0.0000372 0.0000702 -0.0000504 0.1573186 -0.0506726 0.0924167 -0.0000307 0.0795993 0.0391631 0.0000085 -0.000076 0.0000388 0.1366344 unknown
polarizability: 230.8224205|-4.6315432|171.3299022|0.0059774|0.0159756|56.2996629 unknown
InChI: InChI=1S/C13H7NO2/c15-12-8-3-1-2-4-9(8)13(16)11-7-14-6-5-10(11)12/h1-7H
charge 0 multiplicity 1
23 atoms
O  0.01037 2.771505 0.000501
O  -0.022206 -2.755118 -0.000122
N  -3.732949 -0.714249 -0.000181
C  1.284588 0.715005 0.000989
C  1.272973 -0.713088 0.000756
C  -1.271409 0.72801 0.000848
C  -1.280282 -0.695492 0.0006
C  0.014995 1.501551 0.00155
C  -0.010106 -1.484445 0.000844
C  2.52132 1.406918 0.000799
C  2.498571 -1.423067 0.000375
C  -2.509438 1.411214 0.000543
C  -2.53374 -1.362754 0.000095
C  3.735445 0.691671 0.000444
C  3.723969 -0.726505 0.000226
C  -3.702597 0.657163 0.000063
H  2.501656 2.501441 0.00097
H  2.461077 -2.517122 0.000176
H  -2.520322 2.504919 0.000709
H  -2.559912 -2.456917 -0.000123
H  4.688384 1.231133 0.000354
H  4.668249 -1.281078 -0.000065
H  -4.679835 1.151802 -0.000151
