program: Gaussian 09
title: 000100645
version: EM64L-G09RevD.01
frameworkgroup: C1[X(C7H7N3O)]
method: RPBEPBE
basis: SDD
operation: Freq
keyword: #pfreq=noraman
keyword: PBEPBE/SDD
title: #p freq=noraman PBEPBE/SDD
converged: NO NO NO NO
title: Mulliken charges:
elementType: O N N N C C C C C C C H H H H H H H
charge: -0.237938 -0.421133 0.012261 -0.004076 0.244398 0.049703 0.095702 -0.769257 -0.746705 0.157663 -0.221045 0.243421 0.267546 0.243448 0.232570 0.232534 0.259791 0.361118
chargesum: 0.00000
title: Mulliken charges with hydrogens summed into heavy atoms:
elementType: O N N N C C C C C C C
charge: -0.237938 -0.060016 0.012261 -0.004076 0.244398 0.049703 0.095702 -0.014842 -0.021811 0.157663 -0.221045
polarizability: 1.37532396e+02 -1.38689751e+00 1.10838412e+02 2.24740748e-04 -9.10402369e-04 4.88290681e+01
1716.lowfreq: -5.1572 0.0002 0.0004 0.0005 9.0996 10.7066 86.3196 90.3527 110.5269
frequency: 86.3046 90.3309 110.5258 140.8552 172.4546 213.6517 298.2156 312.3352 324.2107 414.1585 418.2683 448.7556 475.0620 560.6783 580.4986 598.9928 628.6860 756.4664 758.5349 778.6697 854.2701 968.7738 1025.8579 1039.3402 1052.3965 1083.3747 1131.7497 1222.3573 1265.8592 1374.5712 1396.6669 1405.1887 1409.9213 1448.2260 1458.8463 1459.0668 1471.6503 1501.4814 1564.6518 1639.0763 2172.8879 2983.4559 2984.8343 3058.3075 3058.9517 3112.1751 3119.1486 3520.2124
redmass: 1.3229 4.2434 2.4272 9.3938 1.0742 4.6455 2.6650 4.7421 3.8765 9.1810 5.4062 11.4742 5.7585 4.6048 4.4447 7.1365 4.6804 7.4653 3.1618 1.6298 3.2924 1.9218 1.4332 2.5854 1.6189 2.4875 5.2272 6.5422 6.3365 6.2070 1.3120 1.2268 1.8615 1.1248 1.3605 1.0468 1.0449 2.1468 4.9699 6.5399 12.6316 1.0390 1.0384 1.0962 1.0977 1.0988 1.0977 1.0789
irintensity: 1.2331 0.0323 1.0586 1.9445 1.5394 0.3428 0.6720 0.3577 10.3848 0.0002 3.3835 2.0444 7.7981 0.6975 4.9649 5.6428 1.7571 12.9894 10.7880 100.8573 9.0884 9.0161 7.2286 6.5392 0.0466 26.6079 59.3275 7.7964 1.0228 15.4521 8.4859 36.5567 5.6151 16.6867 10.8655 0.0180 40.2184 31.9901 34.2999 349.6581 5.3475 9.7172 14.0680 7.6033 16.7704 7.3249 5.5996 69.2472
temp: 298.150 k
press: 1.00000 atm
elementType: 8 7 7 7 6 6 6 6 6 6 6 1 1 1 1 1 1 1
symmnumber: 1
zpe: 346623.7 jmol-1
zpe.correction: 0.132022 hartree
zpe.thermalcorrener: 0.142472 hartree
zpe.thermalcorrenthalpy: 0.143416 hartree
zpe.thermalcorrgfe: 0.096033 hartree
zpe.sumelectzpe: -509.609777 hartree
zpe.sumelectthermal: -509.599327 hartree
zpe.sumelectthermalent: -509.598383 hartree
zpe.sumelectthermalfe: -509.645765 hartree
dipole: 6.7467 1.1683 0.0001
dipole: 6.8471
quadrupole: -78.9866 -61.6341 -63.1399
quadrupole: 4.7635 0.0012 0.0006
quadrupole: -11.0664 6.2861 4.7803 4.7635 0.0012 0.0006
hfenergy: -509.7417987 hartree
pointgroup: C01 [X(C7H7N3O1)]
dipole: 2.5394703 0.89888 0.0006515 debye
dipolederiv: -0.8569807 -0.5232114 -0.0000876 -0.45757 -0.8242459 -0.0000743 -0.0000554 -0.0000635 -0.3595718 -0.5066361 -0.8217935 -0.0000284 0.246562 -0.2290025 0.0000537 -0.000082 -0.0001616 -0.2689625 -0.3119219 0.6217236 -0.0000529 -0.1727509 0.2719141 -0.0001192 -0.0000701 0.0000816 -0.1286116 -0.225362 0.0407613 0.0000543 0.0440647 -0.2341392 -0.0000133 0.0000354 0.0000022 -0.2259698 0.1900682 -0.1023011 0.0000161 0.1370791 0.4691133 0.0000188 -0.0000013 -0.0000902 0.0626463 0.3377703 0.3097637 0.0001338 0.4261303 -0.2042024 0.000178 0.0002708 0.0002606 -0.0305202 -0.085796 -0.03573 -0.0000404 -0.3889822 -0.3266408 -0.0000661 -0.0000218 0.0000271 0.077203 -0.0284766 -0.0859236 -0.0000181 -0.0620831 -0.2768532 0.000003 0.00002 0.0000246 0.031907 -0.117852 -0.0705529 -0.0000717 -0.1053258 -0.0574764 -0.0000483 -0.0002083 -0.0001643 0.0611839 1.1055633 0.8041885 0.0001252 0.4691447 0.8761771 0.0000456 0.0001497 0.000096 0.2636673 0.094522 -0.1119773 -0.0000365 -0.0626774 0.0236864 0.0000043 -0.0000456 -0.0000059 0.0291144 0.0806257 -0.0258214 -0.1013013 -0.0359848 0.0556486 -0.0222934 -0.0884784 -0.0603416 -0.0100045 -0.0445159 0.1024086 0.0000128 0.010542 0.0774712 -0.0000012 -0.0000138 -0.0000035 0.118304 0.0806238 -0.0258237 0.1012961 -0.0359889 0.0556415 0.0223012 0.0884674 0.0603146 -0.0099787 0.0661073 -0.0278859 0.0291098 -0.0613494 0.0196927 -0.1061874 -0.0266325 -0.1140652 -0.03295 0.0661581 -0.0278686 -0.0290952 -0.0613896 0.019511 0.1062293 0.0266508 0.1141235 -0.0327681 -0.0004749 0.044747 0.0000172 0.1444377 0.0292083 -0.000028 0.0000371 -0.0000132 0.1265307 0.1565773 -0.0647033 -0.0000331 -0.0338583 0.2544962 -0.0000028 -0.0000219 -0.0000214 0.3287807 unknown
polarizability: 137.2387861|3.1104251|111.1320154|0.0230889|-0.0016942|48.8290742 unknown
InChI: InChI=1S/C7H7N3O/c1-4-5(2)9-10-7(11)6(4)3-8/h10H,1-2H3
charge 0 multiplicity 1
18 atoms
O  -1.667246 -2.151755 -0.000208
N  0.648671 -1.857272 0.000212
N  1.825505 -1.152289 0.00043
N  -3.103663 1.238974 -0.000852
C  0.451031 0.883766 0.000037
C  1.73079 0.190723 0.000344
C  -0.722707 0.117285 -0.000206
C  0.421617 2.393726 0.000093
C  3.043432 0.938423 0.000921
C  -0.682511 -1.360917 -0.000102
C  -2.022734 0.724862 -0.000437
H  0.946612 2.79638 0.886773
H  -0.608083 2.782908 0.000135
H  0.946547 2.79644 -0.886598
H  3.141695 1.587441 0.891131
H  3.141985 1.588333 -0.888584
H  3.873885 0.215938 0.000741
H  0.763275 -2.875765 0.00027
