program: Gaussian 09
title: 000009733
version: EM64L-G09RevD.01
frameworkgroup: C1[X(C6H12FNO)]
method: RPBEPBE
basis: SDD
operation: Freq
keyword: #p
keyword: freq=noraman
keyword: PBEPBE/SDD
title: #p freq=noraman PBEPBE/SDD
converged: YES YES NO NO
title: Mulliken charges:
elementType: F O N C C C C C C H H H H H H H H H H H H
charge: -0.252862 -0.265626 -0.348807 -0.030195 -0.366764 -0.707046 -0.694804 0.176962 -0.304506 0.226128 0.251146 0.211010 0.202702 0.224182 0.216411 0.202700 0.218703 0.222529 0.336007 0.241812 0.240317
chargesum: 0.00000
title: Mulliken charges with hydrogens summed into heavy atoms:
elementType: F O N C C C C C C
charge: -0.252862 -0.265626 -0.012800 0.195933 0.095393 -0.063751 -0.050872 0.176962 0.177624
polarizability: 9.06278490e+01 2.77304640e+00 7.59732461e+01 4.59146663e+00 3.20991876e+00 5.98293786e+01
1716.lowfreq: -10.0657 -5.7948 -0.0011 -0.0007 -0.0007 11.7197 21.1839 64.9739 72.3764
frequency: 19.8391 64.5815 72.2455 114.6514 190.8846 203.6683 225.6157 262.6478 281.8819 357.9853 411.1668 444.3689 464.6024 568.8500 641.8354 673.9401 807.2869 828.3570 913.1636 919.6418 935.3860 949.7135 974.0250 999.3542 1090.5247 1137.1081 1154.8870 1169.7729 1179.5682 1241.2571 1269.2257 1301.4554 1332.4834 1339.5063 1360.0153 1379.2564 1399.8183 1436.9701 1451.3093 1467.7622 1473.3879 1482.6602 1490.7276 1512.8822 1626.7524 2967.0914 2972.0580 2982.3112 2997.1531 3037.1179 3059.1541 3065.0871 3069.4342 3074.1372 3077.3828 3113.2024 3536.6212
redmass: 4.0781 3.3156 4.2143 2.5509 2.3778 1.3333 1.3562 2.8159 2.1709 2.5593 1.8847 4.3467 5.3852 3.6389 3.5752 1.1438 2.8521 2.1103 2.8720 1.2194 2.7864 1.4541 2.0431 1.8773 4.6762 2.3152 1.9278 1.0920 1.8184 1.7096 1.4705 1.2815 1.2724 1.3749 1.3464 1.2299 1.2150 1.0782 1.0930 1.0533 1.0567 1.0594 1.0563 1.9669 8.3178 1.0363 1.0366 1.0704 1.0764 1.0559 1.0992 1.0988 1.0994 1.0998 1.0991 1.1100 1.0770
irintensity: 1.3204 0.2944 0.8664 21.0461 4.7684 2.6142 3.6608 4.6175 2.6653 10.5000 1.3623 8.0531 10.8340 8.8229 5.6949 120.7557 11.3776 13.9054 35.8692 5.7213 28.5611 2.3594 3.9546 0.8764 11.1842 1.4004 5.0877 1.5174 9.2099 1.4776 50.7908 1.8852 11.8433 3.3613 3.7520 24.8694 16.3263 16.3916 12.6346 3.5341 10.8034 14.7202 23.2018 182.1950 236.3505 32.9429 23.2419 13.5181 36.9719 16.6957 22.0328 30.3323 22.3178 52.5508 52.0098 10.7824 39.9693
temp: 298.150 k
press: 1.00000 atm
elementType: 9 8 7 6 6 6 6 6 6 1 1 1 1 1 1 1 1 1 1 1 1
symmnumber: 1
zpe: 463994.2 jmol-1
zpe.correction: 0.176726 hartree
zpe.thermalcorrener: 0.187580 hartree
zpe.thermalcorrenthalpy: 0.188524 hartree
zpe.thermalcorrgfe: 0.138873 hartree
zpe.sumelectzpe: -464.930472 hartree
zpe.sumelectthermal: -464.919618 hartree
zpe.sumelectthermalent: -464.918673 hartree
zpe.sumelectthermalfe: -464.968325 hartree
dipole: 1.1912 1.8306 0.5866
dipole: 2.2615
quadrupole: -50.7550 -64.1955 -53.3124
quadrupole: 0.5154 1.0900 -1.5944
quadrupole: 5.3327 -8.1079 2.7752 0.5154 1.0900 -1.5944
hfenergy: -465.1071979 hartree
pointgroup: C01 [X(C6H12F1N1O1)]
dipole: -0.5711079 -0.6820249 -0.0172505 debye
dipolederiv: -0.3933899 0.0110003 0.0099438 0.1645149 -0.7869095 -0.0057653 0.0139784 0.0053282 -0.2678806 -0.6684726 0.0280142 0.018301 -0.3857498 -0.9780769 0.0102499 0.0437344 -0.0009065 -0.3628569 -1.1840399 -0.2759972 -0.027842 -0.2407886 -0.5083951 0.0283198 0.0271277 0.093424 -0.4817022 0.068936 0.0091931 0.0191455 0.0454865 0.1475646 -0.0082365 0.0460044 0.0293871 0.0863745 0.5363211 -0.01388 -0.0111894 -0.2384534 0.0872256 -0.0343668 -0.0709427 -0.0861286 0.2649874 0.0279334 0.0170201 -0.0416295 0.0168259 -0.0629391 -0.0640216 -0.0615781 -0.0713681 0.0371601 -0.0533308 0.0536224 -0.0076607 0.055977 0.0144371 -0.0412446 -0.0766427 -0.0388623 0.0639873 1.2620769 0.2836826 -0.1092617 0.651907 1.1452894 -0.0268004 -0.1741278 -0.0609294 0.1639781 0.155728 0.1199954 0.0364283 -0.0187948 0.7129698 -0.0155139 0.0426546 -0.0256835 0.3695764 -0.0189204 -0.055256 0.0844632 -0.0547774 -0.0183275 0.0600145 0.0663255 0.055893 -0.0621313 0.0755237 -0.0452116 -0.0351241 0.0403149 -0.041339 -0.0805159 -0.0154909 -0.0374949 0.060951 -0.0723356 -0.0400142 0.0873295 -0.0255363 0.0386184 0.1243221 0.0707938 0.0737501 -0.0507577 0.0331153 -0.0770324 0.0775277 -0.0513228 0.0028928 0.0520349 0.1151466 0.1214647 -0.0605864 -0.0126032 -0.0330978 -0.1419404 -0.0036065 0.0788727 0.0121724 -0.1428408 -0.0264864 -0.0854798 -0.0915662 0.138844 0.0713565 0.117041 -0.007654 -0.0304153 0.0623498 -0.0164007 0.0895988 0.015612 -0.0186292 0.075134 -0.0761215 0.0186077 0.1140905 0.1284446 0.0754889 -0.0545403 -0.0548923 0.0202264 -0.1088518 0.0123878 0.0992769 -0.0117007 -0.1455393 0.0163997 -0.0808833 0.0745865 -0.0542526 -0.0070811 -0.0056068 -0.1499256 -0.0792544 0.0121524 -0.0896737 0.0715729 0.222117 -0.03228 0.0382707 0.003714 0.1760053 -0.0088655 0.077391 -0.0229087 0.331128 0.0089811 -0.0238534 -0.0706692 -0.0080363 0.0166869 -0.0133237 -0.117547 -0.0266671 0.0115753 0.0686197 -0.0120941 0.0433495 0.0006252 0.0151194 0.0188205 0.0986062 0.0323742 -0.0440714 unknown
polarizability: 91.7963051|1.5088246|75.7863124|0.5386779|1.5354363|58.8478561 unknown
InChI: InChI=1S/C6H12FNO/c1-5(2)4-8-6(9)3-7/h5,8H,3-4H2,1-2H3
charge 0 multiplicity 1
21 atoms
F  2.343101 -2.00416 0.31581
O  1.347639 1.510481 0.443669
N  0.177954 -0.512733 0.681978
C  -2.042851 0.068079 -0.390007
C  -1.150799 0.087787 0.880629
C  -2.319157 -1.373587 -0.875543
C  -3.361265 0.820776 -0.097614
C  1.3038 0.241865 0.47089
C  2.594796 -0.555968 0.263454
H  -1.493968 0.611489 -1.185277
H  -0.98577 1.131916 1.200136
H  -1.665816 -0.450325 1.701279
H  -2.852488 -1.955447 -0.09798
H  -2.952169 -1.368382 -1.781511
H  -1.385088 -1.908885 -1.129001
H  -3.930215 0.321093 0.710655
H  -4.006967 0.847525 -0.994084
H  -3.169914 1.86433 0.213984
H  0.287124 -1.529879 0.666531
H  3.318677 -0.315293 1.060438
H  3.021876 -0.329282 -0.728136
