program: Gaussian 09
title: 000100659
version: EM64L-G09RevD.01
frameworkgroup: C1[X(C19H30O4)]
method: RPBEPBE
basis: SDD
operation: Freq
keyword: #pfreq=noraman
keyword: PBEPBE/SDD
title: #p freq=noraman PBEPBE/SDD
converged: YES YES NO NO
title: Mulliken charges:
elementType: O O O O C C C C C C C C C C C C C C C C C C C H H H H H H H H H H H H H H H H H H H H H H H H H H H H H H
charge: -0.338891 -0.156141 -0.360529 -0.178521 -0.386333 -0.386021 -0.386191 -0.384972 -0.389330 -0.382049 -0.367637 -0.372828 -0.391421 -0.353423 -0.593643 -0.356616 0.323862 -0.696645 -0.053013 -0.090975 0.234771 0.097763 -0.476332 0.195907 0.193693 0.193177 0.194582 0.197225 0.192709 0.193005 0.193809 0.201714 0.193798 0.192235 0.191750 0.208476 0.187860 0.189638 0.189323 0.237024 0.206176 0.187729 0.187551 0.205207 0.282302 0.194697 0.194856 0.215084 0.209716 0.209587 0.260253 0.373729 0.372298
chargesum: 0.00000
title: Mulliken charges with hydrogens summed into heavy atoms:
elementType: O O O O C C C C C C C C C C C C C C C C C C C
charge: 0.034839 -0.156141 0.011769 -0.178521 0.003267 0.001738 0.003744 0.001843 0.006182 0.001937 0.028699 0.006133 0.051778 0.021857 -0.106134 0.032937 0.323862 -0.062257 -0.053013 -0.090975 0.234771 0.097763 -0.216079
polarizability: 2.86130720e+02 -8.46187040e+00 2.31874372e+02 2.10479382e+01 -5.47888700e+00 1.62607292e+02
1716.lowfreq: -9.1857 -1.5634 -0.0019 0.0007 0.0011 3.5028 8.5643 14.0621 21.2562
frequency: 6.3629 12.7317 20.7849 27.5100 41.5378 43.8734 57.1825 72.0275 75.5465 78.7813 92.4818 99.3108 110.7473 126.4098 129.3037 138.0263 152.8293 155.7469 162.3791 176.5256 219.0098 226.6379 263.8438 295.5625 302.6375 320.2045 328.7802 352.3261 378.9631 392.8978 405.2910 408.0860 427.8756 451.9155 472.4577 491.9616 495.7449 501.9387 557.4573 623.1016 658.4685 690.6122 719.8355 721.8025 724.7349 729.3612 738.8629 742.6630 765.5370 798.4779 811.8123 836.1773 865.7239 873.5700 887.6713 910.9766 947.5045 953.2884 979.3569 984.9058 995.6637 1005.3937 1029.2478 1031.0346 1033.6468 1058.1799 1073.1581 1076.6726 1080.4514 1081.7998 1083.7143 1086.1834 1123.2429 1123.4559 1155.6509 1180.7624 1198.1180 1200.1424 1216.5176 1223.3994 1226.3268 1232.3620 1246.4134 1251.2218 1266.4298 1274.0539 1277.9485 1281.8922 1284.1253 1291.4409 1292.0879 1293.7551 1298.3595 1299.0830 1308.6628 1323.3896 1335.9568 1346.5701 1353.6012 1354.1401 1357.4021 1358.1422 1365.2410 1387.5527 1403.6902 1459.3797 1459.4619 1461.9579 1462.3546 1464.3321 1466.3558 1469.3431 1472.7031 1476.4006 1476.9272 1481.2406 1485.0719 1487.9190 1488.9315 1542.1649 1562.3692 1588.4243 1630.2850 2941.5862 2948.0687 2948.3101 2949.7465 2949.9784 2951.6620 2952.1700 2955.6779 2959.7421 2963.2696 2966.1349 2967.7040 2970.9937 2981.1144 2983.7883 2987.5805 2992.5633 2998.7683 3006.7542 3016.0314 3024.9527 3032.5793 3038.7434 3043.4331 3056.6488 3067.5383 3069.7271 3139.6459 3540.0872 3551.9513
redmass: 3.5665 3.5708 4.1908 2.4311 4.4019 2.9163 1.8173 7.8681 2.8643 3.8794 1.8423 5.5106 2.1920 2.0941 3.5896 2.0149 2.0490 2.0179 6.7740 4.5538 3.6155 1.1373 4.8888 3.0914 3.4017 6.9220 4.6865 4.1131 4.5701 7.7609 1.6262 4.8251 2.6539 1.7708 4.2426 3.2008 3.2804 1.8107 4.5734 5.1050 3.4855 9.5004 1.0587 1.0658 1.0801 1.1247 4.5275 1.1993 1.2126 1.3046 2.6043 1.4094 2.7074 1.5269 1.9015 1.4098 4.4542 1.3292 5.2792 4.5182 1.1894 4.4112 3.2892 1.1080 3.6483 3.0534 2.7194 2.4472 2.1088 2.1873 1.6979 2.5207 2.3353 1.9923 2.9342 1.9093 1.4033 1.4481 1.5071 1.4613 1.3191 2.5430 1.3884 1.3138 1.3318 1.3164 1.0339 1.3107 1.0430 1.0820 1.3852 1.2996 1.1001 1.1451 1.5371 1.5403 1.4733 1.4756 1.6497 1.6564 1.6428 1.6426 2.6696 1.2174 2.8071 1.0743 1.0746 1.0716 1.0734 1.0662 1.0816 1.0962 1.0973 1.0433 1.0928 1.0954 1.0977 1.0981 1.0996 9.6805 10.2557 9.3847 8.3663 1.0690 1.0586 1.0585 1.0593 1.0590 1.0596 1.0596 1.0597 1.0597 1.0606 1.0629 1.0586 1.0366 1.0961 1.0967 1.0975 1.0986 1.1003 1.1022 1.1032 1.1031 1.1022 1.1021 1.1031 1.0965 1.1007 1.0993 1.0926 1.0651 1.0659
irintensity: 0.0166 0.0119 0.0018 0.0003 0.0094 0.0189 0.0296 9.7261 0.0898 1.0919 0.0071 0.0600 0.0631 0.0150 0.0898 0.0212 0.0026 0.0213 1.2417 0.0045 0.4187 0.0098 2.1117 2.3359 0.6947 0.5693 10.1450 3.6251 11.5578 0.8120 10.7111 14.4621 26.5516 129.7822 13.8656 23.1547 3.4998 41.9331 8.8838 0.9517 0.0444 21.2281 17.2194 0.2866 9.5709 0.2716 0.4797 1.2596 0.1976 2.0848 39.5394 0.9637 25.6964 3.2856 4.8048 1.5214 126.6268 5.5168 30.8521 1.3770 1.2125 37.8029 2.3223 0.3697 17.9860 5.5407 3.0688 0.8135 0.5778 0.0613 11.3565 6.5100 68.3420 112.5648 175.7870 1.5810 19.1782 21.0416 12.4219 13.9165 3.0671 49.1216 5.5073 4.6963 10.4093 3.2324 2.5639 14.9160 0.2631 1.5280 13.7268 3.9250 0.0997 1.2756 5.5340 2.4153 1.5716 1.4304 0.3706 0.2239 0.5805 0.7451 20.5142 11.1746 5.7388 0.0187 0.0456 0.3120 0.2056 0.2193 0.6393 1.6738 4.0028 12.6831 1.0967 2.8138 1.4242 1.7910 57.3113 40.9369 300.2718 232.5529 23.1761 21.5194 0.0063 0.0689 2.6293 0.8332 5.4452 0.1372 4.5754 1.3924 39.2630 86.1700 256.7499 36.8388 0.4360 1.0809 2.0653 2.2958 1.9565 1.4680 0.8206 4.0532 5.0867 15.8116 295.4343 36.7282 98.7500 55.6184 5.3534 31.6927 52.3331
temp: 298.150 k
press: 1.00000 atm
elementType: 8 8 8 8 6 6 6 6 6 6 6 6 6 6 6 6 6 6 6 6 6 6 6 1 1 1 1 1 1 1 1 1 1 1 1 1 1 1 1 1 1 1 1 1 1 1 1 1 1 1 1 1 1
symmnumber: 1
zpe: 1188471.9 jmol-1
zpe.correction: 0.452665 hartree
zpe.thermalcorrener: 0.479712 hartree
zpe.thermalcorrenthalpy: 0.480656 hartree
zpe.thermalcorrgfe: 0.389050 hartree
zpe.sumelectzpe: -1041.076578 hartree
zpe.sumelectthermal: -1041.049531 hartree
zpe.sumelectthermalent: -1041.048587 hartree
zpe.sumelectthermalfe: -1041.140193 hartree
dipole: 1.1793 -0.6193 0.0915
dipole: 1.3351
quadrupole: -137.7089 -161.2049 -138.6101
quadrupole: 16.2776 5.9949 7.9130
quadrupole: 8.1324 -15.3636 7.2312 16.2776 5.9949 7.9130
hfenergy: -1041.5292433 hartree
pointgroup: C01 [X(C19H30O4)]
dipole: 0.4653297 -0.2369449 0.0570252 debye
polarizability: 286.2135267|-6.2765579|230.3203996|21.7444661|-11.2932586|164.0784572 unknown
InChI: InChI=1S/C19H30O4/c1-2-3-4-5-6-7-8-9-10-11-12-13-15-18(22)16(20)14-17(21)19(15)23/h14,20,23H,2-13H2,1H3
charge 0 multiplicity 1
53 atoms
O  -4.514499 2.425978 0.259268
O  -4.79769 -2.394131 0.61385
O  -7.179428 -2.432204 -0.674423
O  -6.91783 2.386962 -1.02013
C  3.124783 -0.029862 -0.199579
C  4.483692 -0.027851 0.536185
C  1.91145 -0.050305 0.757013
C  5.697815 -0.005106 -0.419445
C  0.552729 -0.043752 0.020784
C  7.056671 0.000628 0.316517
C  -0.658866 -0.060517 0.97941
C  8.271189 0.02393 -0.63881
C  -2.014523 -0.038655 0.240712
C  9.63033 0.030618 0.096741
C  -3.224641 -0.070613 1.219858
C  10.844412 0.053559 -0.859845
C  -4.562217 -0.00246 0.509639
C  12.198418 0.060088 -0.117586
C  -5.111903 1.190468 0.077998
C  -5.270061 -1.273162 0.249121
C  -6.596477 -1.194855 -0.481899
C  -6.435271 1.274544 -0.645919
C  -7.127394 0.00342 -0.89225
H  3.074799 -0.910099 -0.874211
H  3.061493 0.865621 -0.852983
H  4.533056 0.852027 1.211633
H  4.548095 -0.92366 1.188951
H  1.971956 -0.948435 1.406645
H  1.965585 0.827498 1.434874
H  5.632449 0.889583 -1.073773
H  5.650265 -0.886033 -1.093542
H  0.497631 -0.922613 -0.654545
H  0.494939 0.85331 -0.63097
H  7.122483 -0.894064 0.970752
H  7.104211 0.881507 0.990774
H  -0.608264 -0.965261 1.619564
H  -0.593622 0.810685 1.665883
H  8.224186 -0.857266 -1.312728
H  8.205239 0.918365 -1.293518
H  -2.084289 -0.917445 -0.428946
H  -2.066827 0.855979 -0.414447
H  9.69816 -0.863634 0.751467
H  9.679397 0.911987 0.770313
H  -3.123644 0.749153 1.965186
H  -3.186224 -1.015536 1.790349
H  10.775678 0.94714 -1.513669
H  10.794247 -0.827157 -1.532473
H  13.048858 0.077787 -0.823985
H  12.305965 -0.838983 0.518424
H  12.285867 0.946437 0.539039
H  -8.085054 0.077024 -1.421835
H  -3.651154 2.332343 0.739786
H  -8.045168 -2.355982 -1.152625
