program: Gaussian 09
title: 000100616
version: EM64L-G09RevD.01
frameworkgroup: C1[X(C7H7NO3)]
method: RPBEPBE
basis: SDD
operation: Freq
keyword: #pfreq=noraman
keyword: PBEPBE/SDD
title: #p freq=noraman PBEPBE/SDD
converged: YES YES NO NO
title: Mulliken charges:
elementType: O O O N C C C C C C C H H H H H H H
charge: -0.404924 -0.397071 -0.247829 -0.074788 0.207995 0.062666 0.178251 0.041380 -0.840868 -0.335970 -0.255979 0.300139 0.235165 0.234511 0.262610 0.275526 0.379770 0.379415
chargesum: 0.00000
title: Mulliken charges with hydrogens summed into heavy atoms:
elementType: O O O N C C C C C C C
charge: -0.025154 -0.017655 -0.247829 -0.074788 0.207995 0.062666 0.178251 0.041380 -0.071052 -0.073360 0.019547
polarizability: 1.59321075e+02 5.20542812e-01 1.03386683e+02 2.07474766e-03 1.92543017e-03 4.25140312e+01
1716.lowfreq: -7.2308 0.0003 0.0006 0.0007 1.8947 11.0985 99.4860 105.8241 137.9658
frequency: 99.4839 105.7880 137.9643 186.4352 233.2325 271.9121 282.5254 310.0656 339.2668 387.5184 417.4238 473.4064 514.2993 519.6070 605.2146 621.8318 706.4075 743.3924 759.4065 784.6936 825.6316 884.9553 968.6419 970.6882 1041.3951 1065.1487 1128.5862 1162.5060 1195.6231 1240.7564 1289.1368 1304.0240 1352.2398 1400.6416 1419.9484 1426.6212 1475.1209 1487.9527 1502.0210 1582.9700 1634.8505 2962.4089 3032.3655 3108.9615 3157.4941 3182.9872 3212.3001 3558.4164
redmass: 2.7813 1.2984 4.0454 7.6887 7.7093 4.6288 3.0271 5.5981 5.3786 6.5682 1.1520 7.1682 6.1248 3.5707 4.7959 4.6742 6.3759 5.5627 7.6618 1.1262 1.4588 2.6871 2.7476 1.3087 1.4611 1.6332 1.5746 1.7770 2.3699 4.3838 1.5459 2.6424 9.4973 1.2652 3.1144 3.8466 1.2656 1.0436 4.2883 7.0995 6.0664 1.0406 1.0985 1.0936 1.0883 1.0971 1.0628 1.0654
irintensity: 0.1083 0.0405 0.3403 8.7792 0.9189 2.6104 1.3411 19.7648 2.1883 6.9311 146.4229 16.7977 8.3922 1.1052 1.9844 1.3205 10.6424 15.2312 12.0818 79.9366 69.1728 13.7543 6.8108 0.6238 1.8922 71.9632 402.4456 3.9036 166.6929 44.9525 77.6547 186.5950 130.9615 25.0232 71.9042 19.3800 58.5693 18.7493 23.4285 137.9061 134.3367 27.5703 19.9296 0.4065 0.4985 2.7988 72.4937 72.9618
temp: 298.150 k
press: 1.00000 atm
elementType: 8 8 8 7 6 6 6 6 6 6 6 1 1 1 1 1 1 1
symmnumber: 1
zpe: 341379.9 jmol-1
zpe.correction: 0.130025 hartree
zpe.thermalcorrener: 0.140141 hartree
zpe.thermalcorrenthalpy: 0.141085 hartree
zpe.thermalcorrgfe: 0.094802 hartree
zpe.sumelectzpe: -550.499150 hartree
zpe.sumelectthermal: -550.489034 hartree
zpe.sumelectthermalent: -550.488090 hartree
zpe.sumelectthermalfe: -550.534373 hartree
dipole: 4.9991 0.4869 -0.0002
dipole: 5.0228
quadrupole: -68.3304 -62.4026 -64.7619
quadrupole: 3.2458 -0.0112 0.0002
quadrupole: -3.1654 2.7624 0.4030 3.2458 -0.0112 0.0002
hfenergy: -550.6291749 hartree
pointgroup: C01[X(C7H7N1O3)]
dipole: 1.9309485 -0.4144565 0.0682102 debye
dipolederiv: -0.4001783 -0.4011366 -0.0032756 -0.3032201 -1.0831075 -0.0135644 -0.0030675 -0.0176405 -0.3514195 -1.6139822 -0.2052176 -0.0451095 -0.1095803 -0.1603838 -0.0031699 -0.0449652 -0.0067534 -0.3982202 -1.1212498 0.0128454 -0.033321 0.8824197 -0.3864766 0.0308793 -0.0307721 0.0002971 -0.1799367 1.6766427 -0.0457703 0.0652737 -0.4370783 0.0337992 -0.0155339 0.0629719 -0.002068 -0.1685742 -0.4032814 -0.5352028 -0.0117138 -0.4908878 -0.2276832 -0.0182169 -0.0119213 -0.0193194 -0.1375849 0.8446552 0.5668836 0.0283955 0.0781261 0.9123574 0.0057699 0.027533 0.0237047 0.1190841 1.5826087 0.160326 0.0537862 -0.0289055 0.5173546 0.0005464 0.0537425 0.0074715 0.125201 -1.176927 0.1722151 -0.0434117 -0.5269907 -0.2525764 -0.019414 -0.0441342 0.0055816 0.0422905 -0.0255411 0.0358652 -0.0040873 0.0220902 -0.0954734 0.0004721 -0.0039823 0.0006401 0.1056178 -0.6630637 0.1582571 -0.0164185 0.4042235 -0.0573041 0.0154658 -0.015734 0.0062827 -0.1945933 0.4290848 -0.0347375 0.0175023 0.3952208 0.0307125 0.0143503 0.0184232 -0.0013034 -0.0449669 0.1026358 -0.1230708 -0.0010737 -0.016677 0.0261052 -0.0005535 -0.0009863 -0.0044483 0.132261 -0.0339171 0.0676101 0.1075728 0.0082634 0.068721 0.0396122 0.1123095 -0.0097123 -0.0312297 -0.0195682 0.066831 -0.1069664 0.0105343 0.0688343 -0.0391876 -0.1117051 0.0145678 -0.0462713 0.0546693 -0.0627133 -0.0044337 -0.0447074 -0.0138955 -0.0023745 -0.0043858 -0.003123 0.1705848 0.0709164 0.0804946 -0.0030508 0.0059269 0.0393978 -0.0001982 -0.0032846 0.0026809 0.1620709 0.2602649 0.0094282 -0.0027461 0.1271958 0.4468252 0.0049812 -0.0025258 0.0011947 0.336836 0.4362311 0.0770928 0.0030777 0.0240463 0.1327932 0.0001356 0.0024841 0.0019472 0.3588505 unknown
polarizability: 158.3280104|-6.8437146|104.2301673|4.1504261|-0.0180687|42.6636118 unknown
InChI: InChI=1S/C7H7NO3/c1-4-6(9)3-2-5(8-11)7(4)10/h2-3,9-10H,1H3
charge 0 multiplicity 1
18 atoms
O  -0.859881 -2.131843 -0.047097
O  2.992297 0.836049 0.103995
O  -3.392591 0.870255 -0.126574
N  -2.516815 -0.080495 -0.097385
C  1.118423 -0.742292 0.029639
C  -0.286765 -0.876035 -0.021693
C  1.623525 0.58549 0.052729
C  -1.14877 0.277467 -0.049307
C  2.03342 -1.949478 0.058489
C  0.787787 1.745866 0.026734
C  -0.595846 1.590774 -0.024129
H  1.433451 -2.87191 0.037121
H  2.711292 -1.979809 -0.817968
H  2.651317 -1.982448 0.978158
H  1.266953 2.7281 0.048179
H  -1.277496 2.447087 -0.046107
H  -1.858925 -1.974648 -0.081582
H  3.515323 -0.00563 0.120496
