program: Gaussian 09
title: 000100629
version: EM64L-G09RevD.01
frameworkgroup: C1[X(C18H16N4O3)]
method: RPBEPBE
basis: SDD
operation: Freq
keyword: #p
keyword: freq=noraman
keyword: PBEPBE/SDD
title: #p freq=noraman PBEPBE/SDD
converged: YES YES NO NO
title: Mulliken charges:
elementType: O O O N N N N C C C C C C C C C C C C C C C C C C H H H H H H H H H H H H H H H H
charge: -0.221944 -0.183619 -0.288616 -0.151777 -0.148713 0.009892 -0.647957 -0.392501 -0.411348 -0.392181 -0.411578 0.083505 0.116152 -0.161124 -0.095879 0.452963 -0.224473 -0.447045 0.523104 -0.143306 0.176323 -0.496144 0.198233 -0.341612 -0.531557 0.238800 0.255442 0.253135 0.231577 0.256273 0.239784 0.231756 0.253814 0.301232 0.242659 0.238984 0.332474 0.358592 0.225618 0.225635 0.245426
chargesum: 0.00000
title: Mulliken charges with hydrogens summed into heavy atoms:
elementType: O O O N N N N C C C C C C C C C C C C C C C C C C
charge: -0.221944 -0.183619 -0.288616 -0.151777 -0.148713 0.009892 0.043108 0.101740 0.073364 0.103875 0.073991 0.083505 0.116152 -0.161124 -0.095879 0.452963 -0.224473 -0.145812 0.523104 -0.143306 0.176323 -0.253484 0.198233 -0.102629 0.165123
polarizability: 5.59851243e+02 -2.68949627e-02 2.89899441e+02 2.11312650e-01 1.00590438e+01 1.12829625e+02
1716.lowfreq: -2.0047 0.0005 0.0006 0.0008 4.4714 8.6852 31.0557 45.8964 59.2359
frequency: 31.0482 45.8910 59.2342 76.6528 91.6574 107.6977 114.8587 118.5842 134.8777 141.4408 164.8005 177.7324 199.3534 200.4443 221.2158 241.5894 261.5960 281.1029 291.1464 333.1589 344.7140 359.3432 366.1315 386.8828 397.0084 413.6693 443.2044 448.4002 483.4775 496.5875 507.4805 510.0897 553.5830 564.9320 615.5408 619.5098 644.2792 662.6398 684.9251 687.8737 719.4278 735.1424 773.7559 780.1525 781.7901 788.2594 793.1911 806.4711 815.5409 840.4277 879.2010 882.3429 894.7093 914.6735 970.9647 973.0868 987.1354 999.6260 1007.4383 1033.9958 1074.9089 1084.8788 1088.7656 1094.6772 1097.2511 1111.4764 1115.0319 1117.2958 1123.1615 1139.0686 1141.2500 1151.6325 1158.0671 1165.0110 1201.5459 1213.5799 1257.7142 1281.4604 1286.1603 1353.1240 1374.9240 1385.1561 1388.2605 1401.4187 1421.5256 1438.6861 1461.4957 1463.7434 1467.9577 1474.0723 1478.5751 1480.3462 1486.3862 1499.3340 1513.7467 1518.3498 1546.6644 1560.9328 1578.5993 1594.6880 1617.8901 2964.7894 3054.4427 3080.8317 3081.9087 3096.1244 3096.4439 3127.5386 3141.6760 3145.8558 3164.2323 3185.4407 3187.2051 3205.0868 3205.6692 3508.5765 3687.2978
redmass: 5.3299 4.4824 4.3683 6.7826 4.2016 3.8895 3.5441 2.3284 4.4812 3.9421 4.1737 4.1976 4.1871 3.6853 4.0214 1.4372 6.0461 4.4062 4.4980 4.9727 5.5433 8.0140 5.2013 6.4056 4.4378 6.3945 3.8922 9.2024 6.8161 1.2194 5.7463 6.0501 6.6766 4.2804 6.9609 6.1886 5.3758 1.1154 6.1997 7.5467 6.6830 6.7377 2.9448 1.7079 1.2131 2.2933 1.7244 3.7409 5.8064 7.6297 5.6883 5.2983 5.3082 1.3318 1.5455 1.7648 1.4540 1.9009 2.1277 1.9844 1.9676 1.3883 1.3845 1.3277 1.3747 1.7909 1.2585 1.6739 2.1696 1.5294 1.4401 1.6730 1.9251 2.8955 2.0918 2.2078 3.5826 6.4831 2.4656 5.9155 6.6360 5.6979 3.3714 7.4967 8.7763 1.1874 1.0862 1.0818 1.0498 1.0808 1.3211 1.1968 4.6285 4.2823 6.5428 7.8123 3.1896 5.0214 3.8483 3.7044 5.2324 1.0326 1.1042 1.0509 1.0507 1.0580 1.0581 1.0998 1.0874 1.0918 1.0956 1.1192 1.1190 1.1176 1.1177 1.0466 1.1021
irintensity: 5.2491 0.7151 0.0175 1.4418 4.0705 1.9964 6.1191 1.3310 5.2717 0.2262 4.4896 0.6830 3.4632 2.1263 34.2399 2.3842 25.7780 15.7161 2.3705 12.6569 7.2588 6.1835 0.7329 22.7400 0.0027 2.6651 15.4622 1.0307 7.4207 146.7803 10.3444 22.8129 5.9917 5.3204 31.2980 6.4993 10.9649 78.9493 28.1314 22.8644 5.4791 0.3425 6.1889 33.5004 22.7409 25.5994 43.0703 5.2506 23.8805 4.2374 2.6537 6.0739 12.1731 1.4027 16.5948 21.7989 55.0843 7.5369 138.4322 9.4848 6.0604 3.0954 2.8130 0.6527 4.8285 26.2343 0.1550 163.3086 58.5886 20.1232 7.2379 3.1525 1.4002 99.0637 126.6261 422.8208 150.6633 24.6170 54.0731 1.8182 95.2137 236.4359 68.5638 429.8239 97.1468 10.5050 0.1392 13.2135 15.1224 115.6417 22.2940 8.4454 55.2352 352.2424 30.2241 127.8784 286.9237 271.2235 181.2071 66.4762 253.1524 119.0380 44.6146 9.0221 39.1965 44.3406 30.5841 27.0649 3.5537 0.1395 23.8836 2.1271 5.7600 23.7324 25.0795 97.3499 84.5121
temp: 298.150 k
press: 1.00000 atm
elementType: 8 8 8 7 7 7 7 6 6 6 6 6 6 6 6 6 6 6 6 6 6 6 6 6 6 1 1 1 1 1 1 1 1 1 1 1 1 1 1 1 1
symmnumber: 1
zpe: 814678.6 jmol-1
zpe.correction: 0.310295 hartree
zpe.thermalcorrener: 0.332141 hartree
zpe.thermalcorrenthalpy: 0.333085 hartree
zpe.thermalcorrgfe: 0.259914 hartree
zpe.sumelectzpe: -1138.330100 hartree
zpe.sumelectthermal: -1138.308254 hartree
zpe.sumelectthermalent: -1138.307310 hartree
zpe.sumelectthermalfe: -1138.380481 hartree
dipole: -2.0993 -0.4204 -0.1044
dipole: 2.1435
quadrupole: -80.3525 -146.4181 -146.0340
quadrupole: 6.9037 1.3485 -5.7260
quadrupole: 43.9157 -22.1499 -21.7658 6.9037 1.3485 -5.7260
hfenergy: -1138.6403949 hartree
pointgroup: C01 [X(C18H16N4O3)]
dipole: 0.8288705 -0.1554273 -0.0051129 debye
polarizability: 559.1666848|4.4773493|290.3261325|-16.6086367|5.9528012|113.0874915 unknown
InChI: InChI=1S/C18H16N4O3/c1-25-11-3-2-9-8-10-14(20-13(9)12(11)19)18(24)16(22-6-7-22)15(17(10)23)21-4-5-21/h2-3,8H,4-7,19H2,1H3
charge 0 multiplicity 1
41 atoms
O  -1.840548 -2.787544 0.065635
O  -1.258759 2.710089 -0.181617
O  5.799117 0.944113 -0.377631
N  -4.144563 -1.168531 0.069425
N  -3.829055 1.62568 0.035757
N  1.040665 1.114982 -0.20304
N  3.475782 2.351305 -0.360321
C  -4.614303 -2.348899 -0.700138
C  -5.238078 -0.971103 -0.935488
C  -3.971731 2.871392 0.829857
C  -4.867556 1.661953 1.113039
C  -2.863545 -0.605263 -0.011513
C  -2.704288 0.793704 0.015582
C  -1.696524 -1.516012 0.002482
C  -1.369934 1.443023 -0.10479
C  -0.343407 -0.899077 -0.056792
C  -0.172654 0.535096 -0.129216
C  0.793892 -1.71484 -0.058909
C  2.098329 -1.136713 -0.133726
C  2.160059 0.310967 -0.207827
C  3.431748 0.982188 -0.289228
C  3.306864 -1.887987 -0.141278
C  4.613907 0.188439 -0.294128
C  4.546593 -1.226372 -0.220204
C  7.070108 0.217636 -0.390687
H  -5.158071 -3.098007 -0.116941
H  -3.949116 -2.756923 -1.467347
H  -4.982685 -0.443049 -1.861336
H  -6.2253 -0.743928 -0.521526
H  -3.181637 3.113481 1.547335
H  -4.375549 3.728789 0.283337
H  -5.906491 1.663931 0.769287
H  -4.67264 1.078138 2.019849
H  0.659119 -2.800683 -0.004811
H  3.268167 -2.980572 -0.084942
H  5.468391 -1.816494 -0.224061
H  4.367386 2.834153 -0.420531
H  2.582447 2.846779 -0.352361
H  7.134563 -0.458454 -1.264849
H  7.207748 -0.362683 0.541963
H  7.846349 0.993297 -0.463008
