program: Gaussian 09
title: 000100562
version: EM64L-G09RevD.01
frameworkgroup: C1[X(C4H5N3O4)]
method: RPBEPBE
basis: SDD
operation: Freq
keyword: #pfreq=noraman
keyword: PBEPBE/SDD
title: #p freq=noraman PBEPBE/SDD
converged: NO YES NO NO
title: Mulliken charges:
elementType: O O O O N N N C C C C H H H H H
charge: -0.418352 -0.250979 -0.250963 -0.188651 -0.368070 -0.367859 -0.390827 -0.189289 0.230906 0.230698 0.225254 0.285401 0.347895 0.348082 0.367971 0.388782
chargesum: 0.00000
title: Mulliken charges with hydrogens summed into heavy atoms:
elementType: O O O O N N N C C C C
charge: -0.029570 -0.250979 -0.250963 -0.188651 -0.020174 -0.019777 -0.022856 0.096112 0.230906 0.230698 0.225254
polarizability: 8.86954579e+01 1.04370713e-01 8.11480121e+01 -1.10513714e+01 -1.11299106e-02 5.49415082e+01
1716.lowfreq: -41.0742 -0.0007 -0.0004 -0.0003 7.4817 12.8994 13.4444 77.7380 90.7631
frequency: -40.9849 77.7365 90.7609 154.0560 257.4897 276.5000 344.8682 370.5900 467.8553 509.1311 510.6988 523.1357 542.3777 603.2596 638.2340 647.9541 701.3239 728.8267 738.0804 800.9532 839.8017 940.1439 948.9824 1014.0376 1058.3891 1159.8650 1235.3758 1238.1746 1340.5378 1356.0046 1368.3492 1404.7360 1405.8992 1442.6241 1674.0432 1680.3340 1683.7527 3060.8840 3505.9515 3575.3226 3585.3846 3586.4184
redmass: 8.8628 7.7585 10.1555 6.3473 6.0170 8.5559 8.8510 9.3136 2.0810 3.3615 2.4696 2.3916 1.7905 3.7379 1.3064 1.3846 8.5334 6.1712 4.5489 7.3618 5.3924 5.7609 2.8902 3.4084 2.6126 2.1754 4.4363 1.5105 1.5752 2.0749 1.4183 1.4914 2.4520 2.7918 8.0630 8.3593 4.7144 1.0882 1.0643 1.0776 1.0771 1.0797
irintensity: 0.7327 0.2393 0.3046 0.7059 0.0057 1.1084 1.6594 36.8455 3.7293 25.7725 99.2511 1.4118 67.9093 118.0341 131.2569 66.8376 15.8391 16.2132 161.4667 3.0033 34.9797 39.6461 1.0342 235.3570 107.5755 97.4715 57.7617 16.8504 1.4299 28.9110 25.6854 49.5826 146.5172 175.8649 139.6813 396.2042 645.6682 12.3314 32.5761 96.0792 76.1468 24.8545
temp: 298.150 k
press: 1.00000 atm
elementType: 8 8 8 8 7 7 7 6 6 6 6 1 1 1 1 1
symmnumber: 1
zpe: 287635.2 jmol-1
zpe.correction: 0.109554 hartree
zpe.thermalcorrener: 0.118421 hartree
zpe.thermalcorrenthalpy: 0.119366 hartree
zpe.thermalcorrgfe: 0.075079 hartree
zpe.sumelectzpe: -619.796205 hartree
zpe.sumelectthermal: -619.787338 hartree
zpe.sumelectthermalent: -619.786394 hartree
zpe.sumelectthermalfe: -619.830681 hartree
dipole: 5.2117 0.0023 -2.7866
dipole: 5.9099
quadrupole: -57.3399 -73.6783 -63.4331
quadrupole: -0.0209 -1.0282 0.0709
quadrupole: 7.4772 -8.8612 1.3840 -0.0209 -1.0282 0.0709
hfenergy: -619.9057597 hartree
pointgroup: C01 [X(C4H5N3O4)]
dipole: 2.0523037 0.0115555 1.092783 debye
dipolederiv: -1.299604 0.0018379 -0.410681 0.0038822 -0.3859372 0.0016487 -0.2323088 0.0006349 -0.3554507 -0.7320621 0.2888515 -0.1188426 0.3414848 -1.1144839 0.1035284 -0.1536682 0.1092763 -0.416074 -0.7224836 -0.2832234 -0.1151476 -0.3359738 -1.1257972 -0.1015072 -0.1507583 -0.1082256 -0.4146748 -0.6515793 0.0000213 0.0435052 0.0015494 -0.2483631 0.0030083 -0.0221008 0.0072421 -0.8808159 -1.0273989 0.1265259 -0.0658336 0.0731654 -0.4178626 0.0530156 -0.271188 0.0806256 -0.6418758 -1.0253994 -0.1353012 -0.0627199 -0.0825347 -0.4212581 -0.0559004 -0.2676149 -0.0866282 -0.6414776 -0.5080556 0.0082888 -0.0285402 0.0090371 -1.5315569 0.002205 -0.0765735 0.002333 -0.387561 0.5815804 -0.0021459 -0.218482 -0.0036618 0.6596387 -0.0000458 -0.0891419 -0.0000765 0.4357381 1.4226781 -0.0517086 0.4579436 -0.162878 1.7850037 -0.008212 0.6059091 0.0338062 0.5793096 1.4208709 0.0481602 0.4558536 0.1587153 1.7875725 0.0096466 0.6081011 -0.030001 0.5776408 1.5876535 -0.0011051 0.2440295 -0.0027277 0.0308487 -0.0073179 0.1770437 -0.0093946 1.0285985 -0.0172654 -0.0007519 -0.0521266 -0.0008543 0.0556488 -0.0004291 -0.0533519 -0.0009769 -0.0403141 0.1854353 0.0312077 -0.0811802 0.0252419 0.1880257 0.0050176 -0.0710454 0.0407344 0.3483447 0.1862246 -0.0319849 -0.0809352 -0.0254873 0.1871123 -0.0055435 -0.0703617 -0.0404755 0.3486473 0.2947089 0.000943 -0.0437078 0.0010764 0.1435853 0.0001515 -0.0373049 0.0002248 0.3258242 0.3046966 0.0003844 0.0768648 -0.0000351 0.4078232 0.0007343 0.1043643 0.000901 0.1341406 unknown
polarizability: 88.733761|-0.0270454|81.1470802|10.993875|-0.0889894|54.9041371 unknown
InChI: InChI=1S/C4H5N3O4/c8-2(9)1-5-3(10)7-4(11)6-1/h1,5-8H
charge 0 multiplicity 1
16 atoms
O  3.18586 0.007623 0.208653
O  -1.796235 2.323532 -0.228487
O  -1.759048 -2.35017 -0.215282
O  1.639128 0.021607 -1.541414
N  -0.004733 1.196312 0.76688
N  0.014371 -1.188938 0.773172
N  -1.670512 -0.012848 -0.369707
C  0.849347 0.01081 0.839545
C  -1.187802 1.252558 0.025793
C  -1.167892 -1.2681 0.032872
C  1.890146 0.014889 -0.323069
H  1.412406 0.017464 1.787306
H  0.353229 2.091567 1.099383
H  0.386372 -2.076285 1.111437
H  -2.525791 -0.021167 -0.928081
H  3.861753 0.007947 -0.523202
