program: Gaussian 09
title: 000100580
version: EM64L-G09RevD.01
frameworkgroup: C1[X(C19H23NO4)]
method: RPBEPBE
basis: SDD
operation: Freq
keyword: #p
keyword: freq=noraman
keyword: PBEPBE/SDD
title: #p freq=noraman PBEPBE/SDD
converged: YES YES NO NO
title: Mulliken charges:
elementType: O O O O N C C C C C C C C C C C C C C C C C C C H H H H H H H H H H H H H H H H H H H H H H H
charge: -0.177867 -0.281630 -0.189223 -0.186548 0.018461 -0.141842 0.298713 -0.091275 -0.185066 -0.525669 -0.548046 -0.479547 -0.514942 0.043084 -0.508215 0.297303 -0.794328 -0.559805 0.146941 -0.357090 0.089204 -0.403157 0.208328 -0.515864 0.217764 0.242594 0.221362 0.216548 0.229752 0.234308 0.219244 0.224289 0.199117 0.226712 0.220305 0.249457 0.249382 0.233850 0.229880 0.242605 0.234770 0.278258 0.232261 0.252108 0.239274 0.212918 0.251320
chargesum: 0.00000
title: Mulliken charges with hydrogens summed into heavy atoms:
elementType: O O O O N C C C C C C C C C C C C C C C C C C C
charge: -0.177867 -0.281630 -0.189223 -0.186548 0.018461 0.075922 0.298713 0.151319 0.036296 -0.079369 -0.094494 -0.056142 -0.067925 0.043084 -0.009377 0.297303 -0.087993 -0.046777 0.146941 -0.124829 0.089204 -0.151049 0.208328 0.187648
polarizability: 2.91425201e+02 -3.47921262e+00 2.20379160e+02 1.45331574e+01 8.06746416e-02 1.50536668e+02
1716.lowfreq: -3.6510 -0.0009 -0.0006 -0.0003 2.0921 9.3597 28.4008 36.5705 64.0792
frequency: 28.3236 36.5071 64.0681 72.1131 78.2339 84.0970 116.1459 118.3842 144.9480 149.6341 172.5145 177.1131 195.3322 204.6650 224.9590 238.1749 244.1911 271.4776 277.6320 302.5590 322.2710 358.5170 364.8467 388.9155 401.2619 412.7060 445.2694 463.6459 479.6258 501.0751 512.0149 542.3588 563.0693 572.2288 585.1867 592.5345 633.0522 661.1016 673.9336 702.1799 709.3960 755.3609 767.5595 813.4232 816.5879 822.4812 835.0223 848.6863 858.4082 874.8034 905.2027 932.9414 945.8807 951.6416 972.4875 987.2393 1000.1187 1009.1040 1011.1586 1028.6481 1052.0169 1060.6227 1078.9793 1088.0163 1106.3694 1116.9313 1124.5531 1131.1046 1142.8519 1151.2410 1161.6661 1172.0370 1179.6469 1197.3117 1206.4168 1224.6766 1232.7759 1241.7530 1244.0646 1245.1740 1250.7209 1255.8444 1261.5526 1286.4244 1291.0575 1293.9786 1315.9537 1322.2255 1328.4766 1331.9509 1344.7271 1351.0601 1355.6346 1373.5227 1378.7880 1383.9256 1400.1888 1427.9988 1429.1909 1455.6167 1458.3881 1459.6796 1470.0962 1471.2813 1474.0138 1474.4221 1479.1435 1488.8926 1491.5051 1567.5548 1600.2237 1655.2029 2902.7607 2907.7399 2961.9149 2963.9671 2972.6738 2976.8465 2979.9535 2985.4770 2989.6025 2999.6794 3007.1058 3037.4609 3040.4049 3049.7517 3055.4035 3057.4687 3072.6976 3073.8850 3080.2589 3091.0552 3130.8169 3148.6427 3169.9073
redmass: 4.0593 5.6769 3.6741 4.6557 8.6223 3.5090 4.7293 2.5731 1.1821 2.2303 3.8976 3.0532 2.6189 2.1736 2.4936 3.0910 3.7123 3.5115 2.5438 5.2330 3.1854 2.7829 3.1888 4.7361 4.4381 4.2577 3.9874 4.3862 2.8931 4.3030 3.3604 2.1719 3.5685 3.5026 3.5219 5.4832 3.4500 5.5004 4.2387 3.2017 4.9425 5.3153 4.8295 2.2776 2.0280 1.8015 1.7405 2.8979 2.1499 2.8713 2.9741 1.9699 1.8118 1.4224 2.5385 2.5962 2.0652 2.0689 2.2772 2.3445 2.3948 2.8107 2.7314 2.1654 1.2647 2.2505 2.0017 2.0173 1.5724 1.3900 1.5304 1.6804 2.2111 1.3856 1.8930 1.9024 2.4853 1.8905 1.7975 4.0230 1.6253 1.5770 1.5495 1.3669 1.4820 1.3575 1.3682 1.4537 1.4794 1.6117 1.4755 1.5739 4.7246 1.7320 3.9990 1.2393 3.4241 1.0806 1.2508 1.0619 1.3052 1.0743 1.0901 1.1016 1.0540 1.0834 1.9294 1.0625 1.0759 7.1919 7.5042 12.0593 1.0816 1.0795 1.0766 1.0710 1.0317 1.0667 1.0620 1.0552 1.0423 1.0600 1.0646 1.0987 1.0972 1.1018 1.0928 1.0990 1.1022 1.1031 1.0995 1.0986 1.1022 1.0874 1.0959
irintensity: 0.1651 3.8837 6.3326 2.4923 1.5509 2.0057 6.1781 1.0856 1.7132 0.3303 2.3141 0.6232 1.1943 1.8577 0.4266 0.4051 1.3081 1.5298 0.3848 1.7269 3.1047 0.5964 2.7694 8.3202 2.0675 1.9231 2.9763 2.0452 1.0988 2.6518 1.1243 3.2730 0.7855 4.7742 2.7526 13.5906 1.4162 6.1282 7.9714 5.7579 6.3097 3.0989 13.3717 4.1796 15.8384 9.2141 5.6592 2.5233 8.9158 14.5918 4.1269 9.5723 1.7553 0.7986 68.5815 8.2346 7.8361 3.6998 39.0441 39.7316 0.4661 32.5461 14.7881 4.9435 0.6814 2.2584 1.8250 2.7759 1.5551 4.5203 0.3704 5.4717 1.0999 4.4902 29.2224 16.8813 38.1323 10.9546 15.9745 165.3278 14.9982 15.2372 1.6435 4.8741 1.8200 1.5567 3.1374 4.0737 9.8550 5.6145 0.7659 8.6698 7.3721 28.5299 81.0995 31.7813 3.5228 17.1152 11.5174 17.7710 23.3624 8.7502 13.1550 6.8776 14.1704 15.8850 107.1151 6.6612 11.5869 15.5549 20.7322 195.8312 4.2615 23.6280 11.0103 4.0962 62.3448 37.9015 35.7475 21.3936 28.6587 24.8174 15.8725 24.1950 40.4054 41.2059 9.4080 10.5743 38.4718 27.2846 17.7498 28.5185 25.0219 5.9288 11.1227
temp: 298.150 k
press: 1.00000 atm
elementType: 8 8 8 8 7 6 6 6 6 6 6 6 6 6 6 6 6 6 6 6 6 6 6 6 1 1 1 1 1 1 1 1 1 1 1 1 1 1 1 1 1 1 1 1 1 1 1
symmnumber: 1
zpe: 1010640.8 jmol-1
zpe.correction: 0.384933 hartree
zpe.thermalcorrener: 0.406960 hartree
zpe.thermalcorrenthalpy: 0.407904 hartree
zpe.thermalcorrgfe: 0.334149 hartree
zpe.sumelectzpe: -1091.585837 hartree
zpe.sumelectthermal: -1091.563810 hartree
zpe.sumelectthermalent: -1091.562866 hartree
zpe.sumelectthermalfe: -1091.636621 hartree
dipole: -1.0286 -1.8478 1.1132
dipole: 2.3899
quadrupole: -177.6403 -138.8787 -140.9785
quadrupole: -31.6364 3.9908 -1.2977
quadrupole: -25.1411 13.6204 11.5207 -31.6364 3.9908 -1.2977
hfenergy: -1091.9707699 hartree
pointgroup: C01 [X(C19H23N1O4)]
dipole: -0.4068802 -0.7068231 0.4679311 debye
polarizability: 291.0134363|-2.2521398|220.1817558|16.6925926|-3.3346134|151.1458372 unknown
InChI: InChI=1S/C19H23NO4/c1-19-10-9-12-11-5-7-16(24-2)18(20(22)23)14(11)4-3-13(12)15(19)6-8-17(19)21/h5,7,12-13,15H,3-4,6,8-10H2,1-2H3
charge 0 multiplicity 1
47 atoms
O  -5.985038 -1.004863 -0.061065
O  5.035588 -0.896368 -0.065161
O  3.786855 2.53238 -0.673728
O  4.465871 1.592185 1.286923
N  3.787654 1.574837 0.189335
C  -2.842154 0.689084 -0.309471
C  -3.565035 -0.532073 0.335648
C  -1.330473 0.679138 -0.029182
C  -0.733409 -0.638297 -0.621821
C  -3.020244 -1.832336 -0.286799
C  -3.719947 1.906241 0.088727
C  -1.477267 -1.91381 -0.119242
C  -0.583023 1.877764 -0.644189
C  -5.039972 -0.188321 0.051243
C  -5.165287 1.349066 -0.067375
C  0.791804 -0.69364 -0.425543
C  -3.458082 -0.576644 1.894801
C  0.900609 1.88403 -0.225672
C  1.553144 0.504063 -0.262633
C  1.473145 -1.93976 -0.438501
C  2.955201 0.373454 -0.075578
C  2.869522 -2.038722 -0.292022
C  3.632211 -0.869808 -0.100416
C  5.640816 -1.416656 1.18096
H  -2.959887 0.568503 -1.413007
H  -1.158381 0.693719 1.068361
H  -0.918095 -0.579179 -1.720168
H  -3.277987 -1.854688 -1.364936
H  -3.497456 -2.718732 0.17108
H  -3.543607 2.785976 -0.553618
H  -3.521799 2.215426 1.132079
H  -1.215609 -2.095241 0.94164
H  -1.126373 -2.799481 -0.681342
H  -1.047195 2.831471 -0.330857
H  -0.666075 1.82722 -1.749233
H  -5.584794 1.578057 -1.066228
H  -5.890128 1.735134 0.671711
H  -2.419322 -0.740411 2.227059
H  -3.817089 0.354184 2.369083
H  -4.075108 -1.409629 2.276777
H  0.987834 2.28393 0.806499
H  1.472578 2.577661 -0.8658
H  0.902725 -2.861654 -0.580543
H  3.377513 -3.006386 -0.35141
H  6.721745 -1.459519 0.982615
H  5.259781 -2.428767 1.417318
H  5.430638 -0.72024 2.012081
