program: Gaussian 09
title: 000100549
version: EM64L-G09RevD.01
frameworkgroup: C1[X(C20H34O3)]
method: RPBEPBE
basis: SDD
operation: Freq
keyword: #pfreq=noraman
keyword: PBEPBE/SDD
title: #p freq=noraman PBEPBE/SDD
converged: YES YES NO NO
title: Mulliken charges:
elementType: O O O C C C C C C C C C C C C C C C C C C C C H H H H H H H H H H H H H H H H H H H H H H H H H H H H H H H H H H
charge: -0.214615 -0.245349 -0.237568 -0.386683 -0.385911 -0.386057 -0.385215 -0.385279 -0.381933 -0.382544 -0.373158 -0.375508 -0.353272 -0.400176 -0.356904 -0.318046 -0.696372 0.312059 -0.357691 0.219051 -0.316337 0.107966 -0.752288 0.194069 0.194149 0.194111 0.194049 0.195209 0.195325 0.193199 0.193160 0.194530 0.194637 0.192154 0.192126 0.198517 0.198687 0.189433 0.189422 0.194803 0.194840 0.187729 0.187728 0.222042 0.222070 0.194772 0.194770 0.219607 0.219568 0.209677 0.209673 0.215210 0.256788 0.282417 0.244493 0.244585 0.248282
chargesum: 0.00000
title: Mulliken charges with hydrogens summed into heavy atoms:
elementType: O O O C C C C C C C C C C C C C C C C C C C C
charge: -0.214615 -0.245349 -0.237568 0.001535 0.002249 0.004476 0.001144 0.003888 0.002346 0.014660 0.005697 0.014135 0.022185 0.043937 0.032637 0.121129 -0.061812 0.312059 -0.100903 0.219051 -0.033919 0.107966 -0.014928
polarizability: 3.59440734e+02 -7.87784064e+00 2.03276329e+02 2.90865846e-01 3.57093809e-02 1.57173957e+02
1716.lowfreq: -1.8122 -0.0024 0.0011 0.0014 3.5127 6.6099 11.5266 12.6187 25.0365
frequency: 11.0511 12.5913 25.0224 36.0524 45.0430 46.6326 64.2013 68.7685 71.9881 73.5758 89.0985 98.1976 103.5788 104.2074 114.4053 116.8434 126.2289 138.6622 146.1685 156.9275 159.5662 161.4154 164.9063 198.8126 225.9643 234.9559 265.8903 306.2456 334.3198 337.7321 376.3971 400.5211 432.4372 453.7427 492.7356 501.9601 525.4960 563.5388 610.7243 639.1255 645.0537 694.4819 722.4676 723.5130 726.3852 733.5307 747.3297 766.2207 772.3071 798.2762 834.6920 876.6495 879.1209 887.2127 887.3556 907.9562 921.6624 956.3203 966.0665 973.1348 979.6368 988.1811 1006.1230 1007.3187 1011.9025 1021.8036 1025.1447 1036.5245 1040.1454 1060.1584 1068.0342 1078.6216 1080.7079 1081.0112 1082.5955 1082.8608 1103.8424 1125.1887 1151.1462 1181.6090 1186.4847 1198.0129 1201.8686 1219.5031 1227.1350 1241.9867 1243.2437 1251.8203 1262.9552 1273.6518 1278.8001 1279.5963 1285.4062 1286.3438 1288.4677 1295.5758 1295.7502 1296.4105 1302.1275 1302.8808 1316.8448 1334.8553 1348.3555 1354.1578 1355.9601 1357.6431 1359.9074 1362.1793 1374.2738 1379.3619 1389.1095 1441.5279 1451.6996 1460.7862 1460.8719 1463.2668 1463.6428 1465.5739 1467.5910 1469.2519 1471.8859 1475.6324 1476.4498 1479.6128 1483.6422 1487.3181 1490.0378 1491.3166 1520.5102 1572.5887 1578.2752 2950.1297 2950.2908 2951.6295 2952.2623 2953.3180 2955.7032 2956.7167 2960.2836 2964.3451 2966.8712 2968.6017 2969.6790 2972.2233 2983.1471 2985.5288 2988.8892 2991.2879 2993.3221 2998.5742 2999.9971 3005.0026 3013.7422 3022.9235 3027.3721 3032.4906 3039.9399 3045.3048 3068.8421 3070.3578 3070.8345 3076.4083 3128.8803 3230.6768 3248.6534
redmass: 5.3372 4.7093 4.9084 4.6095 4.3098 1.7883 1.5164 1.6542 4.2137 2.6212 1.5370 2.6303 5.0819 2.2528 1.9117 4.1774 2.2579 2.0241 2.3081 2.5128 4.0997 2.3587 2.5550 3.7771 1.1337 4.7490 3.5064 6.9322 4.5869 3.4068 3.7532 3.7146 3.5000 3.4396 3.1685 3.0458 3.4603 5.4851 4.0635 3.3325 5.6347 7.5381 1.0583 1.0636 1.0736 1.0905 1.1125 1.1907 1.2132 1.1737 1.2047 1.2236 7.7095 1.9062 1.3674 5.9845 1.2189 2.2846 1.1898 5.9436 5.9469 4.9218 1.1330 4.3607 1.4293 1.7349 3.8642 1.0553 3.4866 3.0991 2.9071 2.2957 2.3883 2.2269 2.1414 2.3948 2.8011 3.2476 1.3976 1.8918 1.7952 1.6150 1.2700 1.4556 1.3125 1.3559 3.8652 1.4244 1.2814 1.3140 1.1360 1.0500 1.0723 3.8702 1.0821 1.1288 1.3091 1.0930 1.1058 1.1144 1.3513 1.4032 1.4788 1.6939 1.6166 1.6376 1.6187 2.4828 1.5061 1.5690 1.2173 1.1057 1.0481 1.0730 1.0729 1.0713 1.0690 1.0688 1.0750 1.0858 1.0947 1.0947 1.0425 1.0962 1.0991 1.1009 1.1007 1.1081 5.3981 7.0246 7.3231 1.0584 1.0585 1.0588 1.0589 1.0593 1.0590 1.0591 1.0593 1.0588 1.0563 1.0582 1.0584 1.0366 1.0960 1.0967 1.0978 1.0365 1.0992 1.1008 1.0591 1.1027 1.1041 1.1047 1.1065 1.1056 1.1051 1.1046 1.1007 1.1058 1.0993 1.0965 1.1009 1.0935 1.1037
irintensity: 0.5597 0.4040 0.2197 0.5026 0.0713 0.0272 3.9973 0.2828 0.2931 1.5150 0.6057 1.0892 0.0065 4.9802 0.2818 1.1207 1.1267 0.0817 0.1095 0.0710 2.2198 0.0485 0.4052 0.4263 0.0007 4.0812 0.5026 0.0062 3.6462 0.1142 1.9602 1.9535 2.4806 0.3370 0.0114 0.0151 0.5384 6.0668 38.5137 5.2630 0.0062 25.4648 17.8597 1.4834 9.4145 0.3914 6.8541 34.1845 36.2398 0.0074 0.6718 0.0785 17.8446 4.4098 8.2072 81.3104 0.3973 29.7420 0.1142 31.8811 32.1433 35.4333 0.2412 12.2770 28.6074 4.7963 28.4385 0.0107 0.1033 4.3338 2.9560 0.2677 59.4403 13.5274 1.0067 13.5720 46.0740 3.8652 1.4329 0.0084 1.1847 0.3059 26.7475 0.0181 0.1346 0.0296 55.4364 13.1674 0.0081 0.8776 0.0999 0.2203 0.1075 66.5347 0.0070 0.0432 0.6242 0.4091 0.0002 0.0040 0.3729 2.6770 1.4668 1.4213 2.5142 0.6425 1.2080 3.7916 60.5641 123.4670 11.3559 57.4381 18.6913 0.0391 0.0395 0.1196 0.0332 0.3916 0.1412 21.7346 16.5301 31.1381 12.3805 14.0878 24.1551 9.2053 19.0709 61.0075 906.2184 74.0035 73.7334 0.0011 0.0694 0.0462 0.1473 0.0551 2.5904 0.3866 1.3930 23.5702 6.7968 59.1134 330.0674 37.0071 0.0159 0.0605 0.1645 2.1962 0.4566 0.7441 35.1929 0.5347 1.6976 0.8499 17.7996 4.0957 8.4032 315.7429 96.8712 92.6719 55.4766 11.6150 17.6953 2.5807 4.2031
temp: 298.150 k
press: 1.00000 atm
elementType: 8 8 8 6 6 6 6 6 6 6 6 6 6 6 6 6 6 6 6 6 6 6 6 1 1 1 1 1 1 1 1 1 1 1 1 1 1 1 1 1 1 1 1 1 1 1 1 1 1 1 1 1 1 1 1 1 1
symmnumber: 1
zpe: 1309817.6 jmol-1
zpe.correction: 0.498883 hartree
zpe.thermalcorrener: 0.527165 hartree
zpe.thermalcorrenthalpy: 0.528109 hartree
zpe.thermalcorrgfe: 0.434327 hartree
zpe.sumelectzpe: -1006.330460 hartree
zpe.sumelectthermal: -1006.302178 hartree
zpe.sumelectthermalent: -1006.301234 hartree
zpe.sumelectthermalfe: -1006.395017 hartree
dipole: 6.6190 -1.1013 0.0145
dipole: 6.7100
quadrupole: -234.7554 -139.2648 -141.9569
quadrupole: -1.2012 -0.1205 -0.0749
quadrupole: -62.7630 32.7276 30.0354 -1.2012 -0.1205 -0.0749
hfenergy: -1006.8293432 hartree
pointgroup: C01 [X(C20H34O3)]
dipole: -2.6027196 -0.4409347 -0.0246188 debye
polarizability: 359.3839686|8.3367801|203.3145183|1.351203|0.732912|157.1925336 unknown
InChI: InChI=1S/C20H34O3/c1-3-4-5-6-7-8-9-10-11-12-13-14-17-22-20-16-15-19(23-20)18(2)21/h15-16H,3-14,17H2,1-2H3
charge 0 multiplicity 1
57 atoms
O  4.633813 0.41201 0.037553
O  6.924143 0.691692 0.060825
O  10.482912 -0.143462 0.077788
C  -4.243118 -0.455103 -0.012267
C  -5.525601 0.407064 -0.014355
C  -2.944021 0.381754 -0.007831
C  -6.825927 -0.428004 -0.0172
C  -1.661177 -0.479851 -0.005516
C  -8.107605 0.435369 -0.019235
C  -0.364224 0.359921 0.00175
C  -9.408887 -0.398457 -0.02117
C  0.918514 -0.5021 0.00339
C  -10.690219 0.465572 -0.022696
C  2.206884 0.354077 0.015992
C  -11.992059 -0.36822 -0.024944
C  3.463676 -0.512589 0.015795
C  -13.266206 0.504018 -0.026273
C  5.85528 -0.193442 0.038073
C  6.29758 -1.52082 0.021338
C  8.111982 -0.117571 0.058301
C  7.732289 -1.459145 0.034077
C  9.416209 0.549014 0.080281
C  9.430403 2.072198 0.106585
H  -4.252237 -1.122555 0.874898
H  -4.247839 -1.120389 -0.901093
H  -5.517173 1.074062 -0.901874
H  -5.520533 1.073142 0.873872
H  -2.940358 1.046855 0.88101
H  -2.935727 1.049298 -0.894799
H  -6.831727 -1.094167 -0.90541
H  -6.835014 -1.094851 0.870453
H  -1.671066 -1.148232 0.880872
H  -1.664505 -1.143535 -0.895468
H  -8.098838 1.101931 -0.90711
H  -8.101573 1.102039 0.868564
H  -0.361197 1.022369 0.892034
H  -0.355012 1.028533 -0.883859
H  -9.415642 -1.064888 -0.909244
H  -9.417967 -1.065194 0.866642
H  0.905462 -1.171962 0.888397
H  0.915048 -1.161314 -0.889675
H  -10.685211 1.131874 0.865466
H  -10.682588 1.132604 -0.910293
H  2.227467 1.018969 -0.868159
H  2.218844 1.004954 0.910683
H  -11.998749 -1.034426 0.861988
H  -11.996255 -1.033511 -0.912585
H  3.512068 -1.163245 0.91215
H  3.527573 -1.141027 -0.895303
H  -13.300039 1.156353 0.86685
H  -13.297422 1.157431 -0.918705
H  -14.182632 -0.114558 -0.027988
H  5.679175 -2.414383 0.002536
H  8.430783 -2.293238 0.026973
H  8.899774 2.452151 0.998803
H  8.90423 2.483561 -0.774181
H  10.473439 2.423121 0.115789
