program: Gaussian 09
title: 000100538
version: EM64L-G09RevD.01
frameworkgroup: C1[X(C10H3Cl3N2O2)]
method: RPBEPBE
basis: SDD
operation: Freq
keyword: #p
keyword: freq=noraman
keyword: PBEPBE/SDD
title: #p freq=noraman PBEPBE/SDD
converged: YES YES NO NO
title: Mulliken charges:
elementType: Cl Cl Cl O O N N C C C C C C C C C C H H H
charge: 0.070381 0.101769 0.099181 -0.279661 -0.169059 0.020234 0.033859 0.397602 0.496530 -0.314208 -0.677555 0.795820 -0.430453 0.275560 -0.229679 -0.734385 -0.247010 0.271461 0.256740 0.262874
chargesum: 0.00000
title: Mulliken charges with hydrogens summed into heavy atoms:
elementType: Cl Cl Cl O O N N C C C C C C C C C C
charge: 0.070381 0.101769 0.099181 -0.279661 -0.169059 0.020234 0.033859 0.397602 0.496530 -0.314208 -0.677555 0.795820 -0.430453 0.275560 -0.229679 0.056690 -0.247010
polarizability: 2.19539815e+02 -8.78888674e+00 1.93298165e+02 9.79697659e+00 -2.83491858e+00 7.44513880e+01
1716.lowfreq: -2.7645 -0.5211 -0.0003 0.0013 0.0016 6.3202 28.6341 48.0868 52.6329
frequency: 28.5736 48.0831 52.6256 66.6857 78.1904 85.4419 103.4944 121.6456 136.7503 172.9066 189.7456 199.3320 266.0226 275.1251 282.8170 315.4941 319.7384 341.1113 409.8945 422.4553 465.9683 468.4191 474.4850 488.4878 537.1875 598.8621 646.7551 678.6088 702.6984 717.4170 740.1127 829.9048 853.8328 898.4572 975.6738 994.2057 1040.9337 1127.2676 1164.1424 1275.4872 1339.2994 1364.8781 1385.7264 1391.7260 1448.1485 1450.6102 1524.9006 1564.7614 1721.8441 2194.4891 2195.9094 3013.0429 3101.1697 3150.9691
redmass: 11.1383 7.6050 2.2094 17.4529 16.8475 1.3254 13.5624 14.0110 16.1764 14.1401 17.0632 28.2534 12.5770 12.5420 4.3959 18.5040 12.6273 19.3178 12.5009 14.1517 7.6457 12.0859 12.2679 7.0256 3.2106 9.9570 10.4307 8.5023 12.8734 11.6885 10.0867 11.7872 11.5655 12.2989 2.5050 11.8468 1.6363 2.9190 7.3802 12.0969 11.9935 12.0038 1.4712 4.5973 1.0458 1.0532 11.9543 12.0040 10.8509 12.6289 12.6261 1.0369 1.0971 1.1015
irintensity: 0.1604 0.4741 4.1820 0.7423 2.8130 0.3188 0.4641 2.8821 1.1467 1.4917 0.7796 0.1585 0.2299 1.2608 2.9248 1.1390 0.7395 1.1826 0.2433 2.4519 8.2301 1.5767 0.4717 8.0186 2.1254 3.4153 9.0169 47.3015 64.2375 18.2419 41.2786 124.7359 8.4324 57.5686 165.9380 90.7244 6.9027 369.9279 66.9105 58.4008 6.4405 88.1532 145.7410 36.4421 18.7946 25.5360 13.6103 67.8219 162.1360 6.4847 2.4797 0.1803 1.3408 6.2195
temp: 298.150 k
press: 1.00000 atm
elementType: 17 17 17 8 8 7 7 6 6 6 6 6 6 6 6 6 6 1 1 1
symmnumber: 1
zpe: 277787.9 jmol-1
zpe.correction: 0.105804 hartree
zpe.thermalcorrener: 0.122788 hartree
zpe.thermalcorrenthalpy: 0.123732 hartree
zpe.thermalcorrgfe: 0.058564 hartree
zpe.sumelectzpe: -2021.765651 hartree
zpe.sumelectthermal: -2021.748666 hartree
zpe.sumelectthermalent: -2021.747722 hartree
zpe.sumelectthermalfe: -2021.812890 hartree
dipole: -4.0461 -1.9669 -1.5035
dipole: 4.7434
quadrupole: -117.4809 -125.8748 -120.5632
quadrupole: 5.2348 1.6356 2.2547
quadrupole: 3.8254 -4.5685 0.7431 5.2348 1.6356 2.2547
hfenergy: -2021.8714544 hartree
pointgroup: C01 [X(C10H3Cl3N2O2)]
dipole: -1.4759279 0.9986972 0.5540223 debye
dipolederiv: -0.1468024 0.2651644 0.0325008 0.2487708 -0.4850514 -0.0471151 0.0170396 -0.0457598 0.0184368 -0.1449612 0.2372672 0.0092219 0.2540867 -0.5270927 -0.0161059 0.0228051 -0.0255484 0.0459422 -0.2242046 -0.3207843 0.0099262 -0.3240116 -0.4809974 0.0154992 0.0216391 0.0260926 0.0422451 -2.1343692 0.3326418 -0.4581721 0.3411645 -0.3354478 0.1285054 -0.4952534 0.1282232 -0.6506598 -0.5503449 0.0073112 0.2087558 0.1163354 -0.2568749 0.0917759 -0.4390458 0.1642749 -0.897154 -0.21765 -0.0283015 -0.0002128 -0.0263702 -0.2064159 0.0095945 -0.0024031 0.005042 -0.2076268 -0.2021691 -0.0071345 -0.0084395 0.000539 -0.1750187 0.0009325 -0.0018988 0.0006329 -0.2028585 1.2593134 -0.1022712 0.1448436 0.1365379 0.2719253 -0.0080391 -0.2724517 0.0624289 0.0018814 -0.2336337 0.119116 -0.0244435 0.191937 -0.192631 -0.0057941 0.025992 -0.0089118 0.1929293 -0.3148866 -0.5818546 -0.0612954 -0.7288045 0.6173336 0.1007508 0.0412427 0.0621846 -0.0028366 0.4081535 -0.2913031 -0.0448849 -0.3315101 0.9112776 0.0323073 -0.0606665 0.0344076 -0.1337534 -0.0544769 -0.0203778 0.0135827 -0.0117473 -0.4114625 0.0012231 0.0222206 -0.0044207 0.2413303 0.5347736 0.5116064 -0.0278497 0.4512636 0.6866489 -0.0420325 -0.0505794 -0.0496525 -0.0787701 1.9954358 -0.2456625 0.1502118 -0.4400793 0.303565 -0.2546895 1.1396178 -0.3506378 1.4927863 0.0803368 0.0844239 0.0003258 0.0877256 0.1034903 -0.0184561 -0.0017813 -0.0110122 0.030388 -0.4175413 0.0223052 0.1086564 0.0009655 -0.0021329 0.0180347 0.1648276 0.0020473 -0.1004791 0.1269214 0.0085115 -0.0012903 -0.0013432 0.009775 -0.0011118 -0.0093226 0.0014414 0.0202166 0.1228421 0.015067 0.0097588 -0.0220748 -0.0056591 0.0568503 -0.0153135 0.0547762 0.127089 0.0031871 0.0249862 -0.0456898 0.0378569 0.1203425 0.0313353 -0.0802061 0.0355681 0.0083671 0.1100762 -0.0307111 -0.015506 0.018758 0.0544261 -0.093465 -0.0264621 -0.0811765 0.0525259 unknown
polarizability: 221.8709863|4.6640153|191.315575|-6.9484997|-1.970395|74.102806 unknown
InChI: InChI=1S/C10H3Cl3N2O2/c1-4(16)17-10-6(3-15)7(11)5(2-14)8(12)9(10)13/h1H3
charge 0 multiplicity 1
20 atoms
Cl -0.796392 2.97563 0.350537
Cl 1.983703 -2.795283 -0.012386
Cl 2.423761 2.732316 -0.008688
O  -2.16706 0.281618 0.525628
O  -2.618416 0.755207 -1.738107
N  -1.755495 -3.190604 0.347326
N  4.637427 -0.212359 -0.261812
C  -0.787568 0.207427 0.300488
C  -0.189766 -1.08229 0.223914
C  0.003434 1.375427 0.229613
C  1.215821 -1.17618 0.079523
C  2.028795 -0.014792 0.005008
C  1.401387 1.264044 0.081187
C  -3.055035 0.589574 -0.595969
C  -1.030726 -2.242637 0.29123
C  -4.465744 0.633164 -0.083513
C  3.452566 -0.121183 -0.139799
H  -4.739224 -0.349384 0.338864
H  -5.150721 0.89072 -0.90325
H  -4.549646 1.374186 0.729504
