program: Gaussian 09
title: 000100527
version: EM64L-G09RevD.01
frameworkgroup: C1[X(C14H15NO2)]
method: RPBEPBE
basis: SDD
operation: Freq
keyword: #p
keyword: freq=noraman
keyword: PBEPBE/SDD
title: #p freq=noraman PBEPBE/SDD
converged: YES YES NO NO
title: Mulliken charges:
elementType: O O N C C C C C C C C C C C C C C H H H H H H H H H H H H H H H
charge: -0.269968 -0.208523 -0.152483 0.246904 -0.531987 -0.451244 -0.520415 0.026489 0.254607 0.198840 0.048748 -0.415737 -0.521238 0.435552 -0.386119 -0.643076 -0.644054 0.228227 0.235801 0.227987 0.221058 0.233549 0.244321 0.233413 0.274514 0.238816 0.221156 0.236499 0.235919 0.219278 0.241947 0.241220
chargesum: 0.00000
title: Mulliken charges with hydrogens summed into heavy atoms:
elementType: O O N C C C C C C C C C C C C C C
charge: -0.269968 -0.208523 -0.152483 0.246904 -0.067960 -0.002199 -0.042546 0.026489 0.254607 0.198840 0.048748 -0.182324 -0.246724 0.435552 -0.147302 0.050498 0.058392
polarizability: 2.98746963e+02 1.77378129e+01 1.72416782e+02 -1.19032212e+00 9.55539275e-01 8.63016219e+01
1716.lowfreq: -10.8187 -6.7877 -0.0009 -0.0004 0.0006 3.4676 48.9691 52.8676 101.0656
frequency: 48.5682 52.8376 101.0602 113.3405 131.9273 132.8664 139.4364 178.6245 192.4580 234.0385 251.0520 274.0141 296.4626 304.4400 345.3795 423.5804 453.9126 456.9462 485.0909 514.5615 525.1260 578.8065 607.3962 631.9618 642.9191 669.4797 697.0147 727.0185 739.1018 801.0823 827.0100 842.0726 852.6789 883.5036 887.2780 911.6439 943.4052 957.6186 972.3196 1017.4057 1040.5406 1048.9062 1054.3849 1105.1836 1111.0887 1132.2290 1137.5550 1157.9971 1179.9382 1196.2110 1202.4554 1249.8633 1255.4060 1270.8870 1282.8297 1303.1377 1320.1426 1354.0882 1380.5437 1416.0312 1428.6346 1449.1773 1457.1121 1463.7952 1464.1940 1465.1227 1476.5825 1479.8678 1491.9609 1505.6679 1529.1923 1534.9239 1601.8868 1630.4402 1679.8049 2945.4260 2953.4477 2972.3839 2981.8117 3010.8475 3013.4965 3018.1223 3038.1078 3054.0953 3082.5485 3097.8724 3109.2089 3135.1022 3175.1474 3189.2668
redmass: 2.7648 3.8534 3.1424 2.2769 2.4565 1.6666 3.8731 1.6415 1.4156 4.0166 3.0653 3.9675 5.2023 5.0400 4.0111 5.9491 3.5844 2.9742 4.1460 7.0361 3.5032 4.4852 5.2409 3.4234 3.1695 3.6627 5.6553 6.4362 3.3130 1.5654 2.4955 4.3492 1.6875 1.9599 3.2275 2.8905 1.3365 4.2998 2.3889 2.3964 1.8958 3.4053 1.5960 1.2395 1.3245 1.2504 1.7925 1.6431 1.7285 1.5633 1.2601 1.9938 2.0920 1.7871 1.4812 1.7464 1.9757 2.4181 4.6697 3.8740 1.2410 2.1287 1.1702 1.3985 1.1330 1.1017 1.0460 1.1047 1.1261 1.1756 5.8228 3.5844 7.9632 7.2335 11.5474 1.0366 1.0389 1.0644 1.0665 1.0661 1.1002 1.1022 1.0938 1.0944 1.1041 1.0969 1.0947 1.0889 1.0936 1.0908
irintensity: 0.4986 3.0488 0.1030 3.0311 1.3675 0.0989 1.4680 0.0635 0.3265 0.6788 2.9999 0.9658 1.0415 4.2455 2.1882 7.1193 1.0171 4.0817 9.7243 1.8729 1.2655 0.1092 1.0744 0.5625 6.1344 5.7042 10.7556 7.2630 1.7454 38.9481 28.9293 37.5497 45.0681 5.6749 4.8123 0.8014 0.2023 19.6292 30.6876 4.4090 6.1881 27.6318 18.8873 0.0743 0.9236 5.8602 24.6662 20.0447 0.3614 2.5510 3.3858 4.3167 14.3651 43.4431 34.1794 0.1040 6.1467 63.2020 49.0105 149.2206 16.5013 9.1193 8.6574 2.0711 0.6143 6.8420 23.2681 4.8822 2.3636 116.1209 68.7667 82.2115 10.8915 974.2127 381.9179 99.9605 107.7768 23.1522 31.9548 37.1429 18.8929 60.1889 24.9348 24.8066 47.7199 4.7672 42.9068 8.4586 15.1522 3.2271
temp: 298.150 k
press: 1.00000 atm
elementType: 8 8 7 6 6 6 6 6 6 6 6 6 6 6 6 6 6 1 1 1 1 1 1 1 1 1 1 1 1 1 1 1
symmnumber: 1
zpe: 678761.8 jmol-1
zpe.correction: 0.258527 hartree
zpe.thermalcorrener: 0.273846 hartree
zpe.thermalcorrenthalpy: 0.274790 hartree
zpe.thermalcorrgfe: 0.216056 hartree
zpe.sumelectzpe: -746.468573 hartree
zpe.sumelectthermal: -746.453254 hartree
zpe.sumelectthermalent: -746.452310 hartree
zpe.sumelectthermalfe: -746.511044 hartree
dipole: -5.2272 -5.4121 -0.0724
dipole: 7.5246
quadrupole: -74.8521 -106.7975 -101.9438
quadrupole: -14.5789 -0.4693 0.3843
quadrupole: 19.6790 -12.2664 -7.4127 -14.5789 -0.4693 0.3843
hfenergy: -746.7271 hartree
pointgroup: C01 [X(C14H15N1O2)]
dipole: -2.0884801 2.0927537 -0.1505354 debye
polarizability: 299.1865223|-15.5204538|171.5731292|5.0276073|-5.4344704|86.7057153 unknown
InChI: InChI=1S/C14H15NO2/c1-15(2)9-6-7-11-10-4-3-5-12(10)14(16)17-13(11)8-9/h6-8H,3-5H2,1-2H3
charge 0 multiplicity 1
32 atoms
O  0.591029 -1.782864 0.157032
O  2.706335 -2.716687 0.293054
N  -3.938299 -0.095083 -0.020035
C  1.704335 0.806712 0.037589
C  2.516011 2.09215 0.013248
C  3.968651 1.59776 -0.287624
C  4.008055 0.102119 0.162421
C  2.544429 -0.294902 0.119854
C  0.272696 0.662159 0.0236
C  -0.25446 -0.668306 0.08139
C  2.05496 -1.655099 0.199928
C  -0.670492 1.726964 -0.04722
C  -1.632223 -0.933098 0.067118
C  -2.565167 0.145149 -0.005069
C  -2.048073 1.489404 -0.061207
C  -4.887243 1.023143 -0.111212
C  -4.441911 -1.474249 0.047266
H  2.151383 2.819237 -0.735677
H  2.45304 2.591808 1.001912
H  4.153718 1.656679 -1.375697
H  4.733598 2.2130 0.216261
H  4.408357 -0.008133 1.190244
H  4.637311 -0.528475 -0.489716
H  -0.303939 2.758931 -0.08964
H  -1.950208 -1.976245 0.112785
H  -2.733013 2.33906 -0.114795
H  -5.914776 0.627896 -0.129379
H  -4.735358 1.616571 -1.035077
H  -4.802485 1.7089 0.755948
H  -5.542858 -1.464018 0.038367
H  -4.112043 -1.984012 0.974476
H  -4.097658 -2.079071 -0.815744
