program: Gaussian 09
title: 000100509
version: EM64L-G09RevD.01
frameworkgroup: C1[X(C9H6ClNO3)]
method: RPBEPBE
basis: SDD
operation: Freq
keyword: #p
keyword: freq=noraman
keyword: PBEPBE/SDD
title: #p freq=noraman PBEPBE/SDD
converged: YES YES NO NO
title: Mulliken charges:
elementType: Cl O O O N C C C C C C C C C H H H H H H
charge: -0.031698 -0.211696 -0.206354 -0.164885 0.012105 0.269745 0.262942 -0.300538 -0.298049 -0.223906 -0.106121 -0.372084 0.201746 -0.435576 0.261386 0.308307 0.262894 0.245230 0.243536 0.283014
chargesum: 0.00000
title: Mulliken charges with hydrogens summed into heavy atoms:
elementType: Cl O O O N C C C C C C C C C
charge: -0.031698 -0.211696 -0.206354 -0.164885 0.012105 0.269745 0.262942 -0.039152 0.010258 0.038989 -0.106121 0.116683 0.201746 -0.152561
polarizability: 2.05186502e+02 7.19465289e+00 1.28242255e+02 5.03129589e+00 -2.93073008e+00 5.43148423e+01
1716.lowfreq: -3.1459 0.0019 0.0022 0.0028 4.6696 8.8388 32.9366 41.3642 80.0751
frequency: 32.9297 41.3628 80.0737 105.2192 113.6464 155.4321 161.8104 192.9663 270.6437 307.1146 328.8592 340.3237 364.8143 380.2149 438.4643 484.6051 519.0403 583.8598 640.4131 646.2796 663.7065 683.7072 692.4201 733.1638 770.9573 802.9006 835.6521 905.4943 916.2878 940.1028 989.5590 993.3665 1061.7345 1096.9122 1160.2393 1200.0076 1210.5136 1230.3575 1261.2341 1348.4698 1358.9592 1376.1663 1407.1747 1458.9386 1475.2718 1570.9380 1603.3279 2164.8741 2959.8340 3018.6809 3164.4499 3184.1359 3187.9626 3425.0483
redmass: 8.9239 8.1814 5.9486 3.1672 6.9899 5.4961 14.2978 6.1800 8.4219 5.8262 4.2363 6.6521 9.4277 7.1462 4.3873 6.9836 3.7347 5.8293 7.8775 1.2307 6.9287 8.6432 1.2829 4.5842 8.2523 1.5121 8.9527 1.4710 7.7945 1.3505 1.6665 3.3802 2.9643 3.0599 1.3935 8.7836 1.0625 3.8648 1.4055 2.1383 2.2106 7.5165 5.3112 1.3656 1.7996 8.4964 7.0925 5.9792 1.0546 1.1060 1.0886 1.0956 1.0933 1.1624
irintensity: 0.3652 0.4873 0.1824 2.0836 1.2970 2.6212 2.7264 0.8226 2.9679 6.7034 6.0001 1.1784 0.7037 1.0827 1.0301 6.3652 15.7321 2.3745 12.1746 71.8085 11.5067 39.2887 59.4050 3.3309 5.0605 49.5137 43.9756 22.0587 61.7070 0.7711 5.8684 72.4291 37.4657 49.7428 18.2705 273.4551 3.9555 186.6897 86.8762 18.7839 24.1719 137.8437 14.9759 112.2327 134.7328 16.0731 15.4363 9.9000 23.9826 15.8771 3.8708 2.9279 10.4850 68.6526
temp: 298.150 k
press: 1.00000 atm
elementType: 17 8 8 8 7 6 6 6 6 6 6 6 6 6 1 1 1 1 1 1
symmnumber: 1
zpe: 341178.7 jmol-1
zpe.correction: 0.129948 hartree
zpe.thermalcorrener: 0.143116 hartree
zpe.thermalcorrenthalpy: 0.144060 hartree
zpe.thermalcorrgfe: 0.088443 hartree
zpe.sumelectzpe: -1085.859580 hartree
zpe.sumelectthermal: -1085.846413 hartree
zpe.sumelectthermalent: -1085.845468 hartree
zpe.sumelectthermalfe: -1085.901085 hartree
dipole: 1.3053 -6.1842 -0.0178
dipole: 6.3205
quadrupole: -79.5776 -90.2441 -88.7151
quadrupole: -6.8663 -2.4306 0.4083
quadrupole: 6.6013 -4.0652 -2.5362 -6.8663 -2.4306 0.4083
hfenergy: -1085.9895282 hartree
pointgroup: C01 [X(C9H6Cl1N1O3)]
dipole: -0.5007613 2.4341565 0.0872186 debye
dipolederiv: -0.8416535 -0.1071507 0.0382309 -0.0673809 -0.1069467 0.0017081 0.0406693 0.009618 -0.0513904 -1.9732242 0.4335803 0.0336308 0.2720575 -0.2169065 -0.0161422 0.0297809 0.0009202 -0.234256 -0.4566613 0.1190417 0.1758457 0.1476744 -0.8084715 -0.186535 0.1840084 -0.1437872 -0.3696958 -0.5666443 -0.1702842 0.2310276 -0.1729753 -0.532975 0.0330064 0.2080595 -0.0362927 -0.3386717 0.8039916 0.269119 -0.4667608 0.1212758 1.6252297 0.1928812 -0.4137906 0.1998249 0.5024771 1.5968956 -0.3742828 -0.0132023 0.379867 0.0352676 -0.0125255 0.0131963 0.0797372 0.1277408 -0.2066843 -0.3214769 0.0522938 0.00047 -0.5158584 -0.028409 0.0218176 -0.0028865 -0.0114696 -0.3978581 0.0944225 -0.0002791 -0.377558 0.0519496 0.0179377 -0.0126752 -0.0004711 -0.1869559 -0.2171066 0.3028691 0.0276757 -0.0489847 0.0997697 0.020899 -0.0202072 -0.0873248 -0.0480046 -0.0577404 -0.2183803 -0.003725 -0.0070409 0.1815379 0.0157384 0.0083315 0.0208717 -0.0669543 1.2387842 0.1808065 -0.0729907 0.1692271 -0.2943989 -0.0190034 -0.0778194 -0.0313609 -0.0865047 1.3447874 -0.2225349 -0.0154396 -0.6517759 0.5216556 0.0112792 -0.0109714 -0.0089986 0.3917034 -0.2145195 0.0466912 0.0035249 -0.0789921 -0.1279375 -0.0033987 0.0001754 -0.0014249 -0.0693734 -0.3992426 0.0237063 0.0026751 0.0222706 -0.2083077 -0.0002201 -0.0074243 0.0015831 -0.2740985 0.0143683 0.0860243 0.0122946 0.091345 -0.0023484 -0.0113381 0.0030573 -0.0101098 0.1696101 0.1138486 0.0117582 -0.0036601 0.0378719 0.1018151 -0.0047799 0.0277598 0.0095436 0.1706168 0.0720769 -0.0546492 0.0000537 -0.0552225 0.0075633 -0.0053314 0.0039242 0.0004934 0.160423 -0.0558475 -0.0406248 -0.0546203 0.113535 -0.0213874 -0.0698326 -0.0419491 -0.091231 -0.0291285 -0.0583414 -0.0501329 0.0560948 0.1158932 -0.0256466 0.0641159 0.0425345 0.0920791 -0.0208825 0.2607713 -0.0085023 -0.0026699 -0.011557 0.236396 -0.0000499 0.0015225 -0.0007838 0.2648147 unknown
polarizability: 204.5616064|7.2530043|127.9445305|-11.1872463|4.8507156|55.2374622 unknown
InChI: InChI=1S/C9H6ClNO3/c1-2-5-14-9-4-3-7(10)6-8(9)11(12)13/h1,3-4,6H,5H2
charge 0 multiplicity 1
20 atoms
Cl 4.562447 0.726202 -0.140006
O  -1.447429 0.185145 0.145974
O  0.902036 -3.081356 -0.588877
O  -0.897839 -2.401894 0.637602
N  0.205587 -2.172958 0.018575
C  -0.071159 0.36335 0.120638
C  0.759193 -0.79673 0.022588
C  0.56799 1.633535 0.143946
C  2.163252 -0.688865 -0.075041
C  1.97036 1.745528 0.073555
C  2.754724 0.581175 -0.039549
C  -2.290782 1.415574 0.161351
C  -3.694046 1.009183 0.131067
C  -4.888045 0.713272 0.105689
H  -0.020484 2.551166 0.217319
H  2.753908 -1.602406 -0.177463
H  2.444384 2.730803 0.101539
H  -2.073287 1.992707 1.082694
H  -2.046536 2.038048 -0.723592
H  -5.927375 0.438224 0.085592
