program: Gaussian 09
title: 000100510
version: EM64L-G09RevD.01
frameworkgroup: C1[X(C9H12N4O5)]
method: RPBEPBE
basis: SDD
operation: Freq
keyword: #p
keyword: freq=noraman
keyword: PBEPBE/SDD
title: #p freq=noraman PBEPBE/SDD
converged: YES YES NO NO
title: Mulliken charges:
elementType: O O O O O N N N N C C C C C C C C C H H H H H H H H H H H H
charge: -0.275798 -0.250962 -0.170092 -0.274895 -0.245432 -0.116728 -0.341913 -0.040786 0.089882 -0.559462 -0.368879 0.260966 -0.274833 0.235738 -0.124916 -0.287528 0.312003 -0.761764 0.287050 0.252910 0.263358 0.228809 0.352113 0.248649 0.235880 0.284281 0.270466 0.284662 0.242613 0.244608
chargesum: 0.00000
title: Mulliken charges with hydrogens summed into heavy atoms:
elementType: O O O O O N N N N C C C C C C C C C
charge: -0.275798 -0.250962 -0.170092 -0.274895 -0.245432 -0.116728 0.010200 -0.040786 0.089882 -0.019502 0.123288 0.260966 0.209696 0.235738 0.159365 -0.017063 0.312003 0.010118
polarizability: 1.52029395e+02 7.64305453e+00 1.59815808e+02 -3.23638502e+01 5.82150680e+00 1.25340974e+02
1716.lowfreq: -7.9987 -0.0005 0.0005 0.0007 4.1847 6.0465 18.8611 32.5568 35.7417
frequency: 18.4641 32.4959 35.6855 54.8525 64.6662 85.9551 99.1056 116.5216 146.4327 157.5328 186.9832 193.7150 224.4011 254.1474 276.3962 303.4215 311.5795 396.6968 421.1216 434.0069 483.9273 516.1408 565.6168 582.9354 604.4756 611.8899 626.6316 662.3214 696.6124 723.7630 755.6190 772.1572 774.0841 799.8734 867.2865 870.5114 883.1611 905.8475 918.9602 959.4390 989.7762 1017.6330 1045.5357 1055.4496 1093.6478 1104.2436 1116.0636 1142.4583 1161.3954 1189.9574 1215.7261 1229.6883 1240.8068 1271.3030 1298.9022 1322.5647 1343.4563 1352.4081 1353.3916 1357.6964 1361.5135 1390.3733 1415.9749 1445.0697 1451.9979 1458.7052 1469.1354 1473.4879 1474.3294 1525.9539 1641.1508 1659.0913 2991.4587 2999.5245 3005.1149 3069.4058 3070.8122 3084.0934 3091.6427 3140.3603 3142.7016 3235.3278 3259.4329 3415.5890
redmass: 6.1328 8.8153 6.0790 6.9784 5.1660 5.9775 4.0940 1.2680 4.6813 5.1933 6.0313 4.0239 4.8407 5.2773 2.6860 6.8068 5.4872 3.1569 3.1329 6.0532 2.5129 4.8218 3.1303 4.9818 5.1413 4.5679 4.7823 4.5991 8.5398 1.3401 10.4219 2.7028 1.5435 3.8506 1.4883 2.0584 5.6629 4.9414 3.6578 1.9884 1.8808 3.3087 1.6665 2.0794 1.8556 2.0668 3.4213 3.1203 1.9390 3.2514 1.2348 3.1152 1.3234 1.9836 3.1998 1.6210 2.9497 2.5456 2.2725 2.7932 1.5354 1.2603 3.1630 1.7973 1.0571 1.0571 1.2262 1.4714 1.0789 1.6843 6.6305 9.6391 1.0648 1.0398 1.0616 1.1015 1.0590 1.0995 1.0935 1.1015 1.1070 1.0928 1.1083 1.0798
irintensity: 0.0291 1.4470 2.9941 3.6657 4.5809 8.0690 0.3056 0.4773 9.9097 3.6818 2.3826 6.0496 1.3812 9.3050 7.6760 0.4607 7.7712 1.3640 3.9606 1.3526 4.9839 0.7617 3.5256 14.2077 8.9582 6.2591 5.2959 16.6185 10.4420 164.7106 22.6662 11.0985 55.9990 7.8461 5.2971 13.2548 6.3756 26.1030 35.2147 11.8227 7.5634 59.4461 10.2924 22.4983 9.2447 22.0325 13.5084 69.7877 25.3054 247.1472 8.4571 16.6813 33.4833 15.6450 102.7582 57.7214 81.4740 151.2879 122.2182 13.6907 1.0047 39.7802 3.2112 11.6738 34.7067 23.6971 44.2791 10.7620 24.7021 137.3986 199.6095 205.5161 27.0374 2.3187 38.1147 9.9010 11.5317 13.9596 5.2721 10.2116 0.3986 3.8122 0.0881 62.3292
temp: 298.150 k
press: 1.00000 atm
elementType: 8 8 8 8 8 7 7 7 7 6 6 6 6 6 6 6 6 6 1 1 1 1 1 1 1 1 1 1 1 1
symmnumber: 1
zpe: 583596.9 jmol-1
zpe.correction: 0.222280 hartree
zpe.thermalcorrener: 0.239890 hartree
zpe.thermalcorrenthalpy: 0.240834 hartree
zpe.thermalcorrgfe: 0.174009 hartree
zpe.sumelectzpe: -943.842502 hartree
zpe.sumelectthermal: -943.824893 hartree
zpe.sumelectthermalent: -943.823949 hartree
zpe.sumelectthermalfe: -943.890773 hartree
dipole: 3.9650 2.4238 -0.7513
dipole: 4.7075
quadrupole: -102.2210 -111.4542 -106.5607
quadrupole: -7.7069 0.0474 13.5339
quadrupole: 4.5243 -4.7089 0.1846 -7.7069 0.0474 13.5339
hfenergy: -944.0647825 hartree
pointgroup: C01 [X(C9H12N4O5)]
dipole: -1.1445956 -1.4558359 -0.0256089 debye
polarizability: 145.4569975|10.5043419|164.3040382|31.7577201|-2.7685302|127.4251405 unknown
InChI: InChI=1S/C9H12N4O5/c1-7(14)18-5-3-10-8(15)6-12-4-2-11-9(12)13(16)17/h2,4,10H,3,5-6H2,1H3
charge 0 multiplicity 1
30 atoms
O  2.160073 0.205159 -0.435334
O  -0.03314 -3.307625 -0.506105
O  -0.426762 2.377996 1.11794
O  -0.405171 0.37527 2.218927
O  3.87618 1.779405 -0.50435
N  -1.911101 -0.80611 0.10511
N  0.969499 -1.886134 1.064653
N  -2.045068 1.261352 -0.874173
N  -0.758594 1.141667 1.211535
C  -1.485538 -1.957162 0.937708
C  2.339377 -2.010767 0.543774
C  -0.105984 -2.46626 0.438955
C  3.019475 -0.643071 0.432004
C  -1.553558 0.553436 0.16916
C  -2.652014 -0.942184 -1.061286
C  -2.731629 0.338658 -1.643168
C  2.716141 1.443381 -0.825378
C  1.718704 2.243758 -1.626242
H  -1.467189 -1.652375 1.992636
H  -2.215579 -2.766713 0.788221
H  2.273441 -2.501713 -0.442012
H  2.955213 -2.654743 1.202516
H  0.772282 -1.152472 1.759452
H  4.025141 -0.738023 -0.014465
H  3.126214 -0.142927 1.413506
H  -3.031921 -1.908746 -1.381774
H  -3.23976 0.631415 -2.558244
H  0.963008 2.682054 -0.947743
H  1.181497 1.600187 -2.341666
H  2.237663 3.056489 -2.155057
