program: Gaussian 09
title: 000100374
version: EM64L-G09RevD.01
frameworkgroup: C1[X(C6ClF13O2S)]
method: RPBEPBE
basis: SDD
operation: Freq
keyword: #p
keyword: freq=noraman
keyword: PBEPBE/SDD
title: #p freq=noraman PBEPBE/SDD
converged: YES YES NO NO
title: Mulliken charges:
elementType: Cl S F F F F F F F F F F F F F O O C C C C C C
charge: -0.114753 0.888332 -0.123351 -0.116597 -0.108907 -0.121280 -0.119558 -0.112287 -0.074690 -0.075719 -0.127207 -0.117411 -0.119813 -0.116819 -0.127616 -0.413272 -0.414003 0.264628 0.288522 0.264044 0.110275 0.211331 0.376150
chargesum: 0.00000
title: Mulliken charges with hydrogens summed into heavy atoms:
polarizability: 1.51259298e+02 6.51451485e+00 1.05817650e+02 8.92554702e+00 4.89881327e-01 1.15941659e+02
1716.lowfreq: -6.0441 -0.0018 -0.0018 -0.0008 6.6969 7.2875 20.4477 27.7413 32.9290
frequency: 20.2616 27.6772 32.9263 43.2202 60.0062 79.7797 95.6303 107.9400 117.5896 122.4069 129.7274 140.5250 162.4534 171.5718 183.7524 192.4311 213.2273 232.5800 236.2492 247.6582 250.5915 266.9390 276.9830 283.1668 288.4928 296.0673 304.8881 315.2100 330.5041 365.0951 381.4823 400.3455 405.4100 419.0587 442.0709 462.5605 513.5760 540.5984 553.1905 566.4774 584.3904 588.3956 654.5008 753.8270 830.8193 854.3449 897.8179 959.6953 984.4787 988.6633 1002.6095 1019.6917 1031.5209 1044.6130 1047.6162 1075.1208 1082.3556 1109.6318 1113.8496 1133.9040 1147.6269 1160.8279 1191.2538
redmass: 22.2049 19.3859 17.9366 19.1773 18.8286 18.8972 23.1727 18.9008 19.5833 17.1057 18.3630 17.7042 17.7326 18.3040 18.2908 18.0781 18.2687 20.0746 20.3183 18.5859 18.8745 18.4202 18.4222 18.6375 18.4697 18.8053 18.7021 18.6563 18.7243 18.0450 22.3698 21.0305 19.6715 18.4156 17.4361 17.8063 17.6103 16.9419 16.9824 17.0833 17.5908 17.5807 17.2050 13.2235 13.7077 18.0789 13.7812 13.7300 14.3557 18.4262 13.7369 13.4113 13.0820 12.9859 12.9993 13.2600 13.1197 13.1712 12.9613 12.5254 12.2948 12.1428 12.3358
irintensity: 0.0622 0.0277 0.1135 0.0513 0.0972 0.3939 0.3392 0.1834 0.6602 1.8926 1.7048 1.9928 2.1536 3.7253 3.9893 14.1439 8.3171 0.1005 0.0686 0.5519 1.0377 0.5256 3.2197 0.9104 1.6853 0.1302 0.2925 0.8450 0.9861 1.2776 76.9901 40.4748 37.5215 24.8323 2.3042 8.4035 1.3339 3.1428 13.6279 1.9204 5.1882 0.2751 46.1158 168.3298 140.6562 40.1373 85.7093 96.5292 15.0010 18.2972 74.8479 69.5896 102.3738 82.4256 68.9819 179.2437 300.8625 165.7741 98.0540 68.5436 53.4601 23.7346 51.2853
temp: 298.150 k
press: 1.00000 atm
elementType: 17 16 9 9 9 9 9 9 9 9 9 9 9 9 9 8 8 6 6 6 6 6 6
symmnumber: 1
zpe: 194619.7 jmol-1
zpe.correction: 0.074127 hartree
zpe.thermalcorrener: 0.098673 hartree
zpe.thermalcorrenthalpy: 0.099617 hartree
zpe.thermalcorrgfe: 0.018095 hartree
zpe.sumelectzpe: -2533.123618 hartree
zpe.sumelectthermal: -2533.099071 hartree
zpe.sumelectthermalent: -2533.098127 hartree
zpe.sumelectthermalfe: -2533.179649 hartree
dipole: 1.7230 0.7874 -1.0524
dipole: 2.1671
quadrupole: -150.9357 -148.5462 -146.6281
quadrupole: -0.5562 2.8850 -0.5326
quadrupole: -2.2324 0.1571 2.0752 -0.5562 2.8850 -0.5326
hfenergy: -2533.1977445 hartree
pointgroup: C01 [X(C6Cl1F13O2S1)]
dipole: -0.6808362 0.3857818 0.3384874 debye
dipolederiv: -0.4719186 0.0559668 -0.2052282 0.0224892 -0.1638365 0.0068321 -0.3495778 0.0551594 -0.4365408 1.4362956 -0.0676276 0.262619 -0.042215 1.0103796 -0.0017793 0.2604672 0.0177367 1.3086803 -0.5548166 0.0872216 0.0693899 0.0686147 -0.2850217 -0.0506359 0.1728594 -0.1070289 -0.3686329 -0.5271094 0.1309042 -0.0973124 0.147437 -0.3750066 0.1082221 -0.2325783 0.1710135 -0.3324525 -0.3707063 -0.0951284 0.0630847 -0.1319123 -0.4206428 0.1555133 0.0245054 0.1382697 -0.3341296 -0.7190617 0.1887926 0.1379162 0.3339393 -0.4239756 -0.1628418 0.1244098 -0.0807393 -0.3658866 -0.5379354 0.0838383 -0.1120963 0.186705 -0.3756583 0.1548337 -0.0863932 0.0726717 -0.3044275 -0.4159374 -0.0684784 -0.1066307 -0.1768686 -0.2980033 -0.1610774 -0.177568 -0.091051 -0.4848793 -0.5353009 -0.0114572 0.1304099 -0.257786 -0.2826392 0.1759294 0.4187117 0.1078791 -0.4693707 -0.281564 -0.1995012 -0.1062123 0.0965101 -0.6299847 -0.20569 0.006566 -0.2959291 -0.336763 -0.444234 -0.0755844 -0.0888362 -0.0711063 -0.287765 -0.0684672 -0.1746587 -0.159948 -0.5047064 -0.4272139 -0.1416059 0.0384148 -0.2219559 -0.5502745 0.0330314 0.1041489 0.1086956 -0.2519372 -0.4262513 -0.0304647 -0.1983139 0.0117628 -0.2896895 -0.0684507 -0.1573491 -0.1171407 -0.6199712 -0.6507505 0.0093577 0.2883252 0.0520301 -0.2710619 0.0021689 0.2574 0.0421219 -0.50302 -0.4529317 -0.0597667 0.0146603 -0.2172919 -0.6744592 0.0301467 0.0128575 0.0289168 -0.2480422 -0.4400723 0.0245043 0.0523339 0.0139746 -0.3791648 0.0919674 0.0883484 -0.0231105 -0.5107014 -0.473312 -0.0234981 -0.0539654 0.00655 -0.4927312 -0.1237636 0.040586 -0.0636262 -0.3980799 1.0486137 -0.2996151 0.0242633 -0.0690049 0.646141 -0.0827114 0.0769913 -0.0796715 0.682087 1.1088091 -0.1116226 -0.2809569 -0.1830783 0.8402025 0.0178055 0.3458314 -0.2326135 0.6849852 0.967378 -0.0461582 0.2872966 0.0241614 0.6784117 0.0191392 0.1339259 0.0252658 0.7987208 0.7535951 0.2936355 -0.0322494 0.0443614 0.9433918 -0.0069832 -0.891408 0.4570489 0.8533707 0.8339776 0.2680027 0.0547809 0.2606768 0.8149475 0.0711406 0.0472469 0.0135677 0.7558902 1.5804468 0.0882846 -0.1416929 0.1020068 1.2664407 0.0656702 -0.0453228 0.0125119 1.385807 unknown
polarizability: 149.8154533|-6.9668723|106.3139388|11.322023|0.1481656|116.8892154 unknown
InChI: InChI=1S/C6F13O2S.Cl/c7-1(8,3(11,12)5(15,16)17)2(9,10)4(13,14)6(18,19)22(20)21;
charge 0 multiplicity 1
23 atoms
Cl 4.935421 -0.670169 1.577115
S  3.422444 -0.613115 -0.286219
F  0.811419 -0.390406 -1.94606
F  -0.915555 1.1022 -1.773157
F  1.462243 2.057737 -0.968446
F  -0.039767 1.893848 0.746042
F  -0.13297 -1.879236 0.128247
F  -1.602273 -1.526841 -1.583813
F  1.440703 -0.36858 1.733186
F  2.653755 1.521248 1.386387
F  -1.523491 -0.170057 1.787292
F  -2.733117 -1.875953 0.866407
F  -3.853766 0.041827 -1.016882
F  -4.279826 0.299898 1.196739
F  -2.817692 1.685807 0.162918
O  4.046777 0.290849 -1.457118
O  2.875363 -2.101159 -0.538063
C  -0.082243 0.233336 -1.036577
C  0.811804 1.144829 -0.108277
C  -0.992382 -0.922965 -0.462205
C  1.928509 0.508477 0.780446
C  -2.128938 -0.62975 0.594237
C  -3.286717 0.368374 0.217702
