program: Gaussian 09
title: 000100344
version: EM64L-G09RevD.01
frameworkgroup: C1[X(C11H10N2O2)]
method: RPBEPBE
basis: SDD
operation: Freq
keyword: #p
keyword: freq=noraman
keyword: PBEPBE/SDD
title: #p freq=noraman PBEPBE/SDD
converged: NO YES NO NO
title: Mulliken charges:
elementType: O O N N C C C C C C C C C C C H H H H H H H H H H
charge: -0.269165 -0.274375 -0.110128 -0.616080 0.069063 0.312305 0.320318 -0.053579 -0.347066 -0.372692 -0.758331 -0.224861 -0.220819 0.122757 -0.234416 0.259161 0.260911 0.261479 0.262282 0.236454 0.231042 0.231600 0.233290 0.349979 0.330871
chargesum: 0.00000
title: Mulliken charges with hydrogens summed into heavy atoms:
elementType: O O N N C C C C C C C C C C C
charge: -0.269165 -0.274375 -0.110128 0.064770 0.069063 0.312305 0.320318 -0.053579 -0.087905 -0.111780 0.001884 0.006181 0.010781 0.122757 -0.001126
polarizability: 2.35738531e+02 6.85486859e+00 1.48643281e+02 2.33098186e-02 5.13939145e-03 5.89291089e+01
1716.lowfreq: -127.0699 -9.5631 -0.0004 0.0003 0.0007 1.6115 7.0000 42.1316 63.2505
frequency: -127.0654 42.1315 63.2450 87.7899 90.4076 162.9910 180.7629 221.9233 270.5667 279.6052 318.9458 401.1680 401.6759 427.3593 490.2239 548.1586 560.1249 614.2595 630.8246 637.1338 639.0124 650.3221 690.3216 698.5392 733.3292 760.9232 782.0105 857.2771 879.7966 936.9483 938.6877 987.5893 988.3918 994.0846 1003.0937 1032.5385 1037.1612 1056.3666 1084.9286 1108.7188 1167.9482 1174.6325 1189.1875 1253.4432 1267.4176 1321.2104 1384.9654 1389.3297 1409.9954 1438.9704 1445.3312 1460.6375 1464.0339 1548.1825 1570.7578 1587.0776 1605.3199 1619.3341 1628.9860 3001.6327 3081.8336 3117.0108 3131.5848 3141.7624 3155.6744 3164.8308 3173.8532 3507.1711 3674.8442
redmass: 1.0182 3.7997 7.3038 5.2497 4.7750 3.8901 6.0441 4.9386 3.2182 8.0303 5.0436 5.0461 2.8307 5.0165 3.4452 1.4341 5.4400 6.4642 1.9692 1.4435 4.5435 5.6567 5.8133 1.7741 5.7907 8.5255 1.9999 1.2488 13.0299 2.4115 1.4271 1.3843 6.2247 6.7695 1.3263 2.0128 1.4470 2.1964 1.6079 2.5117 4.9584 1.0624 1.1828 5.3236 4.2957 1.3549 7.7921 3.0955 1.4908 2.3406 1.0425 1.1143 2.1820 6.9832 1.4559 6.3382 9.5949 6.2731 4.2152 1.0367 1.0969 1.1006 1.0852 1.0887 1.0931 1.0961 1.1010 1.0453 1.1042
irintensity: 0.1897 0.2203 0.8613 1.0059 12.8090 15.0389 0.5852 0.3258 1.4199 1.3061 0.6836 10.3846 0.0147 0.8732 13.8505 118.1211 3.7859 0.5062 136.9944 6.0989 27.7590 3.8250 50.5383 60.3674 8.0465 1.1526 45.9717 0.0109 10.9496 9.8593 5.7014 0.0187 1.0317 35.8405 0.4481 1.3746 6.3219 5.3757 11.5797 34.0501 10.4840 0.0716 0.5193 32.8045 5.8306 2.6258 8.5539 103.0633 25.9782 14.7039 16.8796 25.9700 31.5454 22.6884 153.7493 3.2957 64.0654 7.4716 350.1273 5.9119 4.5636 8.4843 0.6108 9.3922 18.8308 16.2166 16.2152 40.9246 65.8881
temp: 298.150 k
press: 1.00000 atm
elementType: 8 8 7 7 6 6 6 6 6 6 6 6 6 6 6 1 1 1 1 1 1 1 1 1 1
symmnumber: 1
zpe: 498641.2 jmol-1
zpe.correction: 0.189922 hartree
zpe.thermalcorrener: 0.202356 hartree
zpe.thermalcorrenthalpy: 0.203300 hartree
zpe.thermalcorrgfe: 0.150204 hartree
zpe.sumelectzpe: -684.082491 hartree
zpe.sumelectthermal: -684.070057 hartree
zpe.sumelectthermalent: -684.069113 hartree
zpe.sumelectthermalfe: -684.122210 hartree
dipole: -3.2395 -0.5129 0.0023
dipole: 3.2799
quadrupole: -89.9546 -69.9119 -90.7328
quadrupole: -2.5033 0.0108 -0.0011
quadrupole: -6.4215 13.6212 -7.1997 -2.5033 0.0108 -0.0011
hfenergy: -684.2724134 hartree
pointgroup: C01 [X(C11H10N2O2)]
dipole: -1.2717984 0.2182882 -0.0014262 debye
dipolederiv: -0.5886253 -0.1449729 -0.0005381 0.1368343 -0.5639791 0.0003251 0.0000958 -0.0005345 -0.1127272 -1.151202 0.1796668 -0.0006759 0.0576493 -0.6972828 -0.000008 -0.0003873 0.0003501 -0.3637856 -0.3090817 -0.036697 0.0000716 -0.293707 -0.3887047 0.0000534 0.000132 0.0000007 -0.228083 -0.4087738 -0.0528856 0.0002065 -0.1217067 -1.2162954 -0.0002353 -0.0000007 -0.0002734 -0.673646 0.6346365 0.0181363 0.0002227 -0.320873 0.3916728 -0.0006061 0.0000708 -0.0001088 0.0954504 0.1630007 -0.0172187 0.0000142 0.009915 -0.0333684 0.0000596 0.0000837 0.0000667 0.0234663 0.2075599 -0.0497275 0.0002803 -0.2880215 0.6525608 0.0004561 -0.0014516 0.0029334 0.071079 -0.3661427 -0.216197 -0.0004809 0.233073 -0.3424592 -0.0002346 -0.0003373 -0.0004224 -0.0128817 -0.0774873 -0.0753361 0.0000457 -0.0047547 0.0142491 -0.0000575 0.0000877 -0.0000842 -0.1394248 -0.0916243 0.0990791 -0.0000279 0.020348 -0.0092651 -0.0000727 -0.0000557 -0.0000143 -0.1377953 -0.1292691 0.2146807 -0.0009707 0.1353131 -0.0819669 -0.0002069 0.0007216 -0.0035451 0.0216414 -0.0034554 0.1332696 -0.0000202 0.2029245 0.0464925 -0.0000342 -0.0000462 -0.000047 -0.1481884 -0.0528647 -0.1141313 0.0000618 -0.1602032 0.1139344 -0.000155 0.0001032 -0.0001467 -0.1472335 1.5275431 0.0919404 0.0010594 0.258561 1.63256 0.0003574 0.001047 0.000192 0.2300101 0.0083159 -0.0039412 0.0000481 -0.0155961 -0.0199663 -0.0000499 0.0000441 -0.0000614 -0.1557227 0.0964903 0.0680558 -0.0000449 0.0592076 -0.0173268 0.000096 -0.0000548 0.0000938 0.1575989 0.0669271 -0.0894041 0.0000213 -0.0723935 0.0160223 0.0000431 0.00001 0.0000267 0.1550169 0.0588835 0.0248466 0.0784339 0.0347509 0.0566494 0.0274755 0.0856056 -0.0106732 -0.0001014 0.0575352 0.0232791 -0.0791145 0.0321683 0.0587225 -0.0291554 -0.0859795 0.0093048 0.0041856 0.0360043 -0.1290952 0.0018121 -0.0359896 -0.0473579 0.0016182 0.0006863 0.002501 0.1308949 -0.0097257 -0.0883316 -0.0000055 -0.1191918 -0.0426143 0.0000559 0.0000039 0.0000644 0.1580481 0.0340237 0.0695308 -0.0000638 0.1008775 -0.0851058 0.0001315 -0.0000708 0.0001249 0.1580986 -0.1308339 0.0250482 -0.0000851 0.025117 0.0903467 0.0000374 -0.0000874 0.0000374 0.1620428 0.263032 0.048674 -0.000107 0.1125231 0.2576509 0.0000753 -0.0000907 0.0001154 0.3699729 0.1651337 0.0217308 -0.0001432 0.0131745 0.2148314 0.0000312 -0.0001298 0.0000998 0.3820836 unknown
polarizability: 235.5463804|-7.980395|148.8354189|0.0521477|0.0060117|58.9291218 unknown
InChI: InChI=1S/C11H10N2O2/c1-7-9(10(12)14)13-11(15-7)8-5-3-2-4-6-8/h2-6H,12H2,1H3
charge 0 multiplicity 1
25 atoms
O  0.371348 -1.436199 0.000558
O  4.415689 0.179317 0.003103
N  0.765515 0.814548 0.00031
N  3.205101 2.186836 0.002205
C  -0.182932 -0.120066 0.000104
C  -1.634937 0.021711 -0.000374
C  1.774282 -1.256061 0.001033
C  1.998409 0.115287 0.001052
C  -2.48489 -1.11811 -0.000116
C  -2.205625 1.324879 -0.001086
C  2.644099 -2.464685 0.000757
C  -3.88473 -0.952186 -0.000546
C  -3.60525 1.480759 -0.001516
C  3.31049 0.810785 0.0023
C  -4.450377 0.344646 -0.001243
H  -2.042645 -2.119133 0.000415
H  -1.53993 2.193802 -0.001286
H  3.299233 -2.470574 -0.887806
H  3.315271 -2.458439 0.877106
H  2.033719 -3.381822 0.011995
H  -4.535612 -1.833201 -0.000334
H  -4.039639 2.4863 -0.002064
H  -5.538668 0.469415 -0.001571
H  2.279254 2.617441 0.001453
H  4.051426 2.752451 0.00265
