program: Gaussian 09
title: 000009251
version: EM64L-G09RevD.01
frameworkgroup: C1[X(C3H6S)]
method: RPBEPBE
basis: SDD
operation: Freq
keyword: #p
keyword: freq=noraman
keyword: PBEPBE/SDD
title: #p freq=noraman PBEPBE/SDD
converged: YES YES NO NO
title: Mulliken charges:
elementType: S C C C H H H H H H
charge: 0.145011 -0.334717 -0.657319 -0.657319 0.229897 0.233914 0.260047 0.260219 0.260219 0.260047
chargesum: 0.00000
title: Mulliken charges with hydrogens summed into heavy atoms:
elementType: S C C C
charge: 0.145011 0.129094 -0.137052 -0.137052
polarizability: 5.15021109e+01 -1.53900011e-05 4.97488085e+01 1.56653145e+00 8.48385698e-06 3.30707440e+01
1716.lowfreq: -13.6961 0.0023 0.0031 0.0041 17.3077 21.0267 96.1796 510.6537 614.5608
frequency: 96.1710 510.6537 614.5605 685.3676 811.2705 814.0002 936.7647 960.4320 1006.4669 1018.7164 1178.6321 1181.7717 1235.6363 1237.4688 1298.4326 1453.3298 1455.7435 1476.2799 3018.5296 3043.8135 3047.1986 3080.8970 3123.2966 3130.5665
redmass: 1.7599 6.4991 6.5360 2.2000 1.5944 1.1955 1.8645 1.6962 1.5661 1.3459 1.4404 1.2696 1.3021 1.1593 1.3463 1.0884 1.0813 1.1116 1.0586 1.0553 1.0596 1.1061 1.1114 1.1113
irintensity: 1.2878 4.1001 2.0698 5.7336 7.9430 0.0413 2.8334 3.6021 0.4977 0.8403 1.4713 6.1374 0.8136 16.6927 17.8744 3.5609 8.2879 0.1665 39.1947 77.5551 13.6885 9.6260 2.4625 56.0938
temp: 298.150 k
press: 1.00000 atm
elementType: 16 6 6 6 1 1 1 1 1 1
symmnumber: 1
zpe: 217816.0 jmol-1
zpe.correction: 0.082962 hartree
zpe.thermalcorrener: 0.087427 hartree
zpe.thermalcorrenthalpy: 0.088371 hartree
zpe.thermalcorrgfe: 0.055378 hartree
zpe.sumelectzpe: -515.620305 hartree
zpe.sumelectthermal: -515.615840 hartree
zpe.sumelectthermalent: -515.614896 hartree
zpe.sumelectthermalfe: -515.647889 hartree
dipole: 2.2782 0.0000 0.1315
dipole: 2.2820
quadrupole: -34.4552 -29.7544 -32.7995
quadrupole: 0.0000 0.0749 0.0000
quadrupole: -2.1188 2.5820 -0.4631 0.0000 0.0749 0.0000
hfenergy: -515.7032672 hartree
pointgroup: C01 [X(C3H6S1)]
dipole: 0.8976128 -0.0002878 0.0183095 debye
dipolederiv: -0.3141364 0.0000316 0.0052388 0.0000315 -0.2162699 -0.0000025 -0.0150186 0.0000041 -0.1547364 0.0726101 -0.0000651 -0.0610412 -0.0000666 -0.1349541 0.0000155 0.0086733 -0.000007 0.1479895 0.1188699 -0.2215115 -0.0234903 -0.1049705 0.1832308 -0.0250125 -0.0334376 -0.0167201 0.1458103 0.1190788 0.2215538 -0.0234669 0.1050129 0.1830214 0.0250288 -0.033424 0.0167427 0.145812 0.0407326 0.0000153 -0.049393 0.0000159 0.0860936 0.0000186 -0.1073844 0.0000377 -0.1344121 -0.1502622 0.0000802 0.0853931 0.0000798 0.1044852 -0.0000263 0.1329194 -0.0000414 0.0278979 0.0120984 0.0845181 0.0493154 0.0328871 -0.0127815 -0.0845042 0.0278781 -0.1190234 -0.0940887 0.0445168 0.0525152 -0.0159283 0.0220905 -0.0900838 0.0994557 -0.0040376 0.130314 0.0049089 0.0444688 -0.0526019 -0.0159943 -0.0221767 -0.0900287 -0.0994483 -0.0041216 -0.130315 0.004901 0.0120234 -0.0845356 0.0493667 -0.0329039 -0.0127129 0.0844753 0.0279531 0.1190085 -0.0940823 unknown
polarizability: 51.6336027|-0.0005838|49.7488087|-0.1146886|0.0003127|32.939252 unknown
InChI: InChI=1S/C3H6S/c1-2-4-3-1/h1-3H2
charge 0 multiplicity 1
10 atoms
S  -1.403507 0.000458 -0.128994
C  1.108832 -0.000349 0.138511
C  0.126971 -1.173158 -0.155844
C  0.127722 1.173095 -0.155807
H  1.414917 -0.000462 1.198389
H  2.019888 -0.000632 -0.484283
H  0.241682 -1.618123 -1.15608
H  0.064861 -1.958247 0.611987
H  0.066117 1.958199 0.61205
H  0.242717 1.618019 -1.156029
