program: Gaussian 09
title: 000100339
version: EM64L-G09RevD.01
frameworkgroup: C1[X(C9H6INOS2)]
method: RPBEPBE
basis: SDD
operation: Freq
keyword: #p
keyword: freq=noraman
keyword: PBEPBE/SDD
title: #p freq=noraman PBEPBE/SDD
converged: YES YES NO NO
title: Mulliken charges:
elementType: I S S O N C C C C C C C C C H H H H H H
charge: 0.122827 0.320651 0.170406 -0.178343 -0.206338 0.490016 0.269248 -0.780802 -0.587293 -0.317006 -0.311252 -0.139408 -0.134410 -0.367971 0.306121 0.307723 0.255874 0.269622 0.254996 0.255338
chargesum: 0.00000
title: Mulliken charges with hydrogens summed into heavy atoms:
elementType: I S S O N C C C C C C C C C
charge: 0.122827 0.320651 0.170406 -0.178343 -0.206338 0.490016 0.269248 -0.166958 -0.587293 -0.061132 -0.041630 0.115589 0.120928 -0.367971
polarizability: 2.54584839e+02 1.12239700e+01 1.51666081e+02 -2.69821782e+00 7.54774944e+00 8.86627293e+01
1716.lowfreq: -3.3379 -1.3316 -0.0026 -0.0002 0.0004 4.2775 36.8483 41.2545 51.9705
frequency: 36.8152 41.2260 51.9667 103.1523 116.2998 136.8248 153.8040 214.2714 259.5881 325.1188 362.8325 392.7477 400.9740 406.1005 487.2035 507.2053 519.2008 542.8804 593.0168 628.1846 656.9389 708.0589 725.1901 777.9097 822.6748 826.5299 891.0093 934.4839 956.2579 965.6010 991.3297 1012.9477 1053.9976 1112.0581 1118.0686 1153.2697 1189.3624 1217.4805 1230.9656 1293.3632 1300.8269 1367.8012 1389.5257 1423.8004 1468.6916 1582.5286 1591.9709 1646.1709 3049.0854 3121.2360 3160.9222 3161.6010 3178.9085 3182.7642
redmass: 9.2133 4.8773 14.3990 9.4858 3.2379 10.0692 15.9702 6.2197 14.7201 6.9681 9.7424 10.5464 7.6995 2.8561 4.3708 13.9294 5.3517 4.8897 4.6065 6.4135 7.4903 4.2881 4.9218 4.7697 1.2827 1.6478 1.6270 3.6111 1.6316 1.3911 6.0440 9.2980 2.4198 1.3723 1.1643 4.6014 1.1554 4.7906 1.4485 1.3444 4.9437 7.0384 3.2269 1.0773 2.4204 7.8699 6.3041 12.5602 1.0570 1.1066 1.0891 1.0890 1.0972 1.0982
irintensity: 0.1919 0.5298 1.4335 4.2364 5.0420 0.6904 0.3632 0.0645 2.6462 5.0587 17.6125 1.7585 2.6415 0.7845 6.0215 2.5943 4.7096 41.5450 0.5263 0.5756 7.6471 4.5068 0.5997 80.1886 3.3843 34.4488 7.2619 10.3728 2.9490 0.7654 38.4153 73.6653 17.5710 6.7117 0.1663 71.5558 12.6026 402.4796 98.1551 15.6384 128.7416 2.4577 9.4445 16.3177 131.3573 1.5970 17.0596 223.8934 3.9501 0.0090 1.3655 2.9425 4.4090 0.8772
temp: 298.150 k
press: 1.00000 atm
elementType: 53 16 16 8 7 6 6 6 6 6 6 6 6 6 1 1 1 1 1 1
symmnumber: 1
zpe: 338200.7 jmol-1
zpe.correction: 0.128814 hartree
zpe.thermalcorrener: 0.141812 hartree
zpe.thermalcorrenthalpy: 0.142756 hartree
zpe.thermalcorrgfe: 0.085740 hartree
zpe.sumelectzpe: -1283.184608 hartree
zpe.sumelectthermal: -1283.171610 hartree
zpe.sumelectthermalent: -1283.170666 hartree
zpe.sumelectthermalfe: -1283.227682 hartree
dipole: -1.4242 -1.4525 0.2782
dipole: 2.0532
quadrupole: -100.1688 -120.4342 -105.0725
quadrupole: 11.1825 -1.9599 7.0442
quadrupole: 8.3897 -11.8757 3.4860 11.1825 -1.9599 7.0442
hfenergy: -1283.3134217 hartree
pointgroup: C01 [X(C9H6I1N1O1S2)]
dipole: -0.593874 0.5053112 -0.2109297 debye
dipolederiv: -0.5885502 -0.0091411 0.0260669 0.0015751 0.0001489 -0.0121869 0.0204414 -0.0095296 0.0022256 -0.6211534 0.208153 -0.0751815 0.1573346 -0.0586578 0.0407096 -0.088834 0.030371 0.0107899 -0.3808336 0.2168185 -0.0995551 0.2011582 -0.6682424 0.2535838 -0.0411005 0.238696 -0.182878 -0.4988919 -0.3201023 0.1514167 0.0161821 -1.0507884 0.3130288 -0.0385488 0.3007767 -0.4138749 -0.9431772 0.1150371 -0.0288859 -0.1974028 -1.4550986 0.5535238 0.0836223 0.5255463 -0.2682885 0.7139465 0.0788318 -0.0477962 -0.0429127 0.0014344 0.0991846 -0.0289928 0.0356316 0.1062012 0.7857286 -0.1312326 0.0347372 -0.4033156 1.5381795 -0.5579481 0.1001295 -0.5046008 0.4011897 -0.47651 0.0054741 0.0065548 0.1405195 0.1718166 -0.026055 -0.0027422 -0.0376216 0.1136645 1.2759277 -0.0900976 0.0200006 0.0522056 1.3548642 -0.6876742 0.022454 -0.6105153 0.0840483 0.029568 -0.0867012 -0.0534622 0.0687299 0.0004391 0.0423807 0.1471948 0.0365285 -0.0586183 0.0094629 0.0760334 0.0502675 -0.0244384 -0.0095829 0.0457751 -0.1409438 -0.0013189 -0.0450844 -0.529663 0.13232 0.1354891 0.0207711 -0.0109468 0.0559551 0.041829 0.0491349 -0.0474607 -0.5160222 -0.1582438 -0.0875516 -0.0123533 -0.0037814 0.0611797 0.0047335 0.0564827 -0.0391268 1.3787663 0.0111908 -0.0566218 -0.0128641 -0.0614293 0.0814849 -0.0626777 0.084268 -0.0918143 0.1028681 -0.0181823 0.0293209 0.0323747 -0.0322669 -0.0186454 0.038617 -0.0271236 0.0677258 0.1133172 -0.0323716 -0.0119315 0.0099081 0.0364838 0.0496741 -0.0536984 0.0555788 0.0035297 0.0242514 0.0627937 0.0483671 0.0558605 0.0679057 -0.0727032 0.0496128 -0.0399453 0.0827172 0.0234895 -0.04822 -0.0462011 -0.0587594 0.0578992 -0.0590227 -0.0522772 -0.032739 0.0935003 0.0446238 -0.0537601 -0.0415116 -0.049927 0.061605 -0.0789457 -0.0403342 -0.0745577 0.0943357 0.0528515 0.0414002 0.0464778 0.045354 0.060018 -0.083299 0.0415153 -0.0750626 0.0872182 unknown
polarizability: 255.4106823|-6.2199253|150.9437902|-2.8796996|-7.1498315|88.5591767 unknown
InChI: InChI=1S/C9H6INOS2/c10-6-1-3-7(4-2-6)11-8(12)5-14-9(11)13/h1-4H,5H2
charge 0 multiplicity 1
20 atoms
I  5.202891 -0.021452 -0.124111
S  -3.745474 -0.705758 0.416736
S  -1.38516 -2.539165 1.131854
O  -1.33693 2.246268 -0.728158
N  -1.200046 0.02554 0.08743
C  0.251716 -0.000287 0.051506
C  -1.897377 1.20045 -0.332114
C  -3.410588 1.027363 -0.242515
C  -1.958613 -1.078329 0.53886
C  0.980389 0.933583 0.817653
C  0.91694 -0.937966 -0.767091
C  2.391436 0.931144 0.76923
C  2.327094 -0.948196 -0.816373
C  3.0535 -0.012251 -0.046527
H  -3.834514 1.779625 0.440957
H  -3.857888 1.14596 -1.241703
H  0.458836 1.663143 1.443754
H  0.34503 -1.658083 -1.358753
H  2.957938 1.655551 1.360148
H  2.844618 -1.675241 -1.447683
