program: Gaussian 09
title: 000100342
version: EM64L-G09RevD.01
frameworkgroup: C1[X(C17H19N3O)]
method: RPBEPBE
basis: SDD
operation: Freq
keyword: #p
keyword: freq=noraman
keyword: PBEPBE/SDD
title: #p freq=noraman PBEPBE/SDD
converged: YES YES NO NO
title: Mulliken charges:
elementType: O N N N C C C C C C C C C C C C C C C C C H H H H H H H H H H H H H H H H H H H
charge: -0.237199 -0.198905 -0.374745 -0.049812 0.277391 0.064147 0.055736 0.199088 -0.538726 -0.049853 -0.655336 -0.805330 0.322492 -0.653181 0.092348 -0.559790 -0.384260 -0.385529 -0.239672 -0.234562 -0.243881 0.223537 0.236136 0.314723 0.244723 0.251012 0.244884 0.278039 0.232051 0.229055 0.222235 0.225019 0.209374 0.257342 0.228190 0.251688 0.272767 0.224959 0.226478 0.227367
chargesum: 0.00000
title: Mulliken charges with hydrogens summed into heavy atoms:
elementType: O N N N C C C C C C C C C C C C C C C C C
charge: -0.237199 -0.198905 -0.060022 -0.049812 0.277391 0.064147 0.055736 0.199088 -0.079053 -0.049853 0.085283 -0.066185 0.322492 0.003447 0.092348 -0.074257 -0.132572 -0.112762 -0.014713 -0.008084 -0.016514
polarizability: 2.70135269e+02 6.04220313e+00 2.34504431e+02 4.12284386e+00 -1.15859187e+01 1.39473515e+02
1716.lowfreq: -31.5551 -2.9417 -0.0007 -0.0007 -0.0006 6.0080 9.3725 44.2125 51.4275
frequency: -30.4170 44.1423 51.4152 63.4204 72.9395 89.3199 107.9834 122.9271 144.2393 157.0801 179.6831 191.6857 213.4889 237.6114 258.6208 278.0940 285.9959 313.9274 335.6738 356.7883 382.1384 388.5733 407.1896 416.1978 460.1667 485.3484 526.9017 563.1490 573.8197 594.6430 616.5848 633.1595 656.0430 668.8143 673.7880 700.9737 715.1867 741.9441 753.8188 782.5846 803.0894 848.5535 859.2600 914.6271 931.8442 936.6225 968.5717 983.1215 985.1294 989.5253 997.0420 998.9358 1027.4755 1038.2583 1040.6430 1057.9824 1073.2200 1085.2814 1115.3881 1129.7778 1170.2194 1171.4503 1185.3897 1188.2860 1214.0482 1255.4147 1285.0381 1306.7350 1314.6898 1318.2790 1326.8531 1376.3093 1380.7419 1386.7056 1395.2680 1407.6356 1410.5282 1432.4818 1444.1991 1451.9361 1454.8607 1463.8923 1468.9284 1471.8021 1474.9059 1481.0211 1483.0973 1487.4039 1492.9212 1525.2901 1544.5171 1585.6213 1599.9884 1609.7622 1638.2854 2925.6349 2964.8421 2979.1365 2980.5832 2985.0474 3030.1232 3031.9897 3076.1431 3079.3861 3081.7363 3100.2899 3114.4664 3117.6403 3121.3602 3131.6347 3144.2327 3156.2506 3168.0984 3516.2668
redmass: 1.1030 3.5681 4.0081 4.8604 3.0491 3.7155 3.6714 3.8134 2.2467 1.3787 2.1022 1.5834 3.3267 4.5856 3.9880 2.3847 3.5048 2.3235 5.1938 4.8951 5.5301 5.6192 2.8796 3.8751 4.8819 3.0346 3.7732 3.8177 1.9077 4.4796 6.1916 4.4949 2.8437 3.6503 5.1628 1.9680 4.0728 3.0037 2.5924 2.2309 1.8565 5.0779 1.2483 2.5796 2.2046 1.9600 4.1280 1.8427 1.7309 5.7582 1.7212 1.6138 2.0637 1.5505 1.7537 1.9668 1.7685 1.7058 1.3305 1.8660 1.3165 1.2731 1.1493 4.2990 1.8130 1.3506 3.9004 1.7651 1.4149 1.6069 1.6897 1.9155 8.3342 1.7118 1.6607 1.5068 2.6433 2.2519 1.6500 1.2016 1.7489 1.2862 1.0890 1.1378 1.1087 2.4148 1.0940 1.1071 1.0992 4.8154 7.1597 6.3505 9.3810 6.1645 6.0877 1.0682 1.0414 1.0358 1.0597 1.0421 1.0993 1.0976 1.1001 1.0934 1.1007 1.0927 1.0962 1.0983 1.0846 1.0881 1.0933 1.0966 1.0991 1.0758
irintensity: 0.0420 0.5623 0.6587 0.9728 0.1587 0.4076 0.3774 0.2443 1.0570 0.2108 1.2002 2.3229 2.2346 0.9894 2.8429 1.2951 8.3879 0.8955 0.3989 0.2971 1.0700 3.3867 0.4334 5.4107 11.6437 6.8147 1.0717 2.9250 45.5493 8.3969 0.8556 3.0484 36.9035 4.8085 5.5135 31.2312 39.9277 22.8057 8.3307 27.8806 2.9582 6.9619 1.8902 1.2799 6.3155 7.6488 8.1746 6.3346 18.4901 0.4894 5.6283 6.5438 5.9002 5.8360 5.4690 9.8496 14.6113 4.5265 8.3191 5.6583 13.0219 10.3787 2.3322 5.6386 3.9537 7.2786 49.0403 24.5373 9.3575 14.5096 17.6565 49.0903 0.8704 13.9745 22.0415 2.9518 41.0762 7.7883 29.2853 24.3953 70.7310 16.4421 6.7810 7.9133 8.1364 4.3768 13.0993 14.8344 3.4206 16.0292 55.6370 0.0734 13.6581 0.6881 584.5580 41.2990 42.4670 37.1214 20.4882 79.7147 5.0987 23.7873 47.3125 17.7192 49.3331 19.7910 11.5174 5.5221 1.2499 6.4030 30.7133 24.4475 19.1557 16.5806
temp: 298.150 k
press: 1.00000 atm
elementType: 8 7 7 7 6 6 6 6 6 6 6 6 6 6 6 6 6 6 6 6 6 1 1 1 1 1 1 1 1 1 1 1 1 1 1 1 1 1 1 1
symmnumber: 1
zpe: 854969.7 jmol-1
zpe.correction: 0.325641 hartree
zpe.thermalcorrener: 0.344631 hartree
zpe.thermalcorrenthalpy: 0.345575 hartree
zpe.thermalcorrgfe: 0.278688 hartree
zpe.sumelectzpe: -897.180414 hartree
zpe.sumelectthermal: -897.161424 hartree
zpe.sumelectthermalent: -897.160480 hartree
zpe.sumelectthermalfe: -897.227368 hartree
dipole: 2.8428 -8.3864 -1.2014
dipole: 8.9362
quadrupole: -106.8604 -136.9501 -120.9780
quadrupole: -7.9737 0.1560 -3.7694
quadrupole: 14.7357 -15.3539 0.6182 -7.9737 0.1560 -3.7694
hfenergy: -897.5060551 hartree
pointgroup: C01 [X(C17H19N3O1)]
dipole: -0.857222 3.3785598 -0.4595587 debye
polarizability: 270.8612732|3.2027168|233.6848108|-3.1401378|12.2493341|139.5671311 unknown
InChI: InChI=1S/C17H19N3O/c1-4-13-17-15(11(2)20(13)3)16(18-10-14(21)19-17)12-8-6-5-7-9-12/h5-9,19H,4,10H2,1-3H3
charge 0 multiplicity 1
40 atoms
O  -1.898847 -3.862413 0.455366
N  -1.710162 1.92506 -0.515202
N  -1.986204 -1.541814 0.512967
N  0.813986 -2.033275 -0.662404
C  -2.492451 0.846963 -0.052389
C  -0.298782 0.153607 -0.366202
C  -1.63162 -0.254914 0.041004
C  -0.388238 1.518276 -0.730224
C  -3.952228 0.954214 0.297005
C  0.874642 -0.744483 -0.359326
C  -2.24523 3.247991 -0.860025
C  0.634135 2.440022 -1.335399
C  2.216944 -0.231546 0.071235
C  -4.231328 1.4824 1.733243
C  -1.504962 -2.752132 0.000733
C  -0.474435 -2.59671 -1.133667
C  2.341391 0.833426 1.002956
C  3.396744 -0.856843 -0.415682
C  3.61484 1.26675 1.433141
C  4.66804 -0.418361 0.007117
C  4.783404 0.64685 0.933274
H  -4.479916 1.595478 -0.43626
H  -4.402785 -0.051142 0.190344
H  -2.688401 -1.631762 1.252658
H  -3.047461 3.526057 -0.158088
H  -1.448145 4.004066 -0.786254
H  -2.653604 3.267095 -1.888372
H  1.563155 1.886877 -1.536793
H  0.283758 2.870508 -2.293447
H  0.898231 3.28265 -0.666003
H  -3.754929 0.83449 2.490983
H  -5.317397 1.511195 1.937118
H  -3.830391 2.502904 1.875652
H  -0.288537 -3.604895 -1.532358
H  -0.933086 -1.961179 -1.925331
H  1.437071 1.303292 1.405497
H  3.286341 -1.693245 -1.112811
H  3.69542 2.080638 2.162804
H  5.569478 -0.906457 -0.380424
H  5.771862 0.985258 1.264364
