program: Gaussian 09
title: 000100310
version: EM64L-G09RevD.01
frameworkgroup: C1[X(C11H13NO5)]
method: RPBEPBE
basis: SDD
operation: Freq
keyword: #p
keyword: freq=noraman
keyword: PBEPBE/SDD
title: #p freq=noraman PBEPBE/SDD
converged: YES YES NO NO
title: Mulliken charges:
elementType: O O O O O N C C C C C C C C C C C H H H H H H H H H H H H H
charge: -0.290426 -0.459032 -0.412267 -0.225454 -0.305359 -0.392961 -0.140368 -0.326097 0.474437 -0.423755 0.180349 0.298335 -0.379325 -0.389260 -0.224433 -0.224548 -0.231624 0.282455 0.241588 0.222100 0.364307 0.231400 0.229503 0.234933 0.233218 0.227954 0.227662 0.230083 0.357436 0.389148
chargesum: 0.00000
title: Mulliken charges with hydrogens summed into heavy atoms:
elementType: O O O O O N C C C C C C C C C C C
charge: -0.290426 -0.101597 -0.023118 -0.225454 -0.305359 -0.028654 0.142087 0.137592 0.474437 0.037148 0.180349 0.298335 -0.144392 -0.156042 0.003521 0.003113 -0.001541
polarizability: 1.84782798e+02 1.49828133e+01 1.24077521e+02 1.75582757e+01 -5.24760842e+00 1.13201857e+02
1716.lowfreq: -0.0009 -0.0009 -0.0007 2.2795 4.5421 11.7563 17.3584 28.4489 41.3956
frequency: 16.8915 24.8622 41.1883 44.0289 62.3877 79.4296 99.2106 114.0613 132.8380 189.5063 195.2020 214.6758 231.3724 265.7611 323.9534 332.6042 358.7131 402.8809 464.1862 498.1797 546.0381 560.7313 565.6309 583.6090 618.6471 625.6693 686.0230 702.0621 703.7085 728.4896 759.9530 821.0417 846.4385 853.8455 892.8823 899.8947 933.2778 952.0602 977.4423 990.1942 991.0098 997.6281 1002.8106 1028.2100 1047.2947 1065.4238 1089.6784 1153.3740 1161.5173 1173.3026 1187.9489 1192.9743 1199.2193 1229.5906 1239.9687 1254.7078 1315.8904 1325.6940 1335.8428 1362.5663 1387.2673 1396.8074 1441.9114 1475.5589 1476.0974 1486.5131 1490.6771 1597.7147 1618.7027 1639.7622 1673.0446 2979.3738 3012.4218 3019.0392 3044.9926 3075.8413 3121.9443 3124.5455 3136.4320 3149.1129 3165.1477 3527.7989 3551.0512 3595.3492
redmass: 3.9524 5.3065 5.1504 5.6873 8.2894 8.6203 4.7985 5.7009 6.2941 1.5076 4.6349 3.0057 3.9217 8.2543 2.2259 3.7334 5.4283 2.7945 3.5172 3.0709 4.8632 2.8890 4.3244 1.1814 6.3398 1.6913 6.3802 9.6016 1.8341 4.0401 2.0754 4.8559 3.8405 1.2478 4.0089 3.0503 1.7028 1.6168 1.3931 4.8270 5.5291 1.3432 3.9701 2.1739 2.2652 2.6677 1.5062 1.7078 1.3076 1.0536 1.1223 1.0892 1.5093 2.3564 1.6187 1.4402 1.5382 1.2742 1.5957 1.6861 8.8094 1.4033 2.2090 1.1275 1.0790 2.1627 2.2243 6.1766 6.2344 10.8525 9.1528 1.0554 1.0575 1.0826 1.1090 1.1079 1.0854 1.0880 1.0920 1.0964 1.1017 1.0642 1.0779 1.0669
irintensity: 0.0452 0.4382 0.9098 1.5373 7.0525 1.4726 2.2867 2.8832 0.7166 103.1598 60.5734 5.2854 23.6758 6.6946 1.2031 4.5520 1.4969 0.0095 25.3049 21.4948 44.2092 29.6547 15.4039 80.8106 0.1074 182.3673 12.3453 35.6149 49.5605 25.4187 52.5842 4.4594 16.2630 0.0123 41.6785 38.6103 0.4891 2.3849 0.0157 346.9305 57.8486 0.2553 106.3856 1.1579 36.6248 60.8295 7.5459 64.5897 103.3810 0.0017 2.9912 1.4843 137.4936 12.3852 78.6577 13.4874 40.2941 0.2689 206.7857 26.4867 0.3782 11.4083 9.1202 44.3328 9.7595 179.8013 221.2352 0.6527 0.2900 334.5063 151.9996 38.2160 24.4968 14.1945 38.2707 14.7397 4.7125 1.9343 15.3211 41.0174 20.5247 39.0451 79.1525 8.0450
temp: 298.150 k
press: 1.00000 atm
elementType: 8 8 8 8 8 7 6 6 6 6 6 6 6 6 6 6 6 1 1 1 1 1 1 1 1 1 1 1 1 1
symmnumber: 1
zpe: 603404.4 jmol-1
zpe.correction: 0.229825 hartree
zpe.thermalcorrener: 0.246937 hartree
zpe.thermalcorrenthalpy: 0.247881 hartree
zpe.thermalcorrgfe: 0.181345 hartree
zpe.sumelectzpe: -856.577610 hartree
zpe.sumelectthermal: -856.560498 hartree
zpe.sumelectthermalent: -856.559554 hartree
zpe.sumelectthermalfe: -856.626090 hartree
dipole: -0.9618 -1.0679 0.6682
dipole: 1.5849
quadrupole: -71.7275 -94.8230 -99.7621
quadrupole: 4.9086 0.8543 -11.7471
quadrupole: 17.0434 -6.0521 -10.9913 4.9086 0.8543 -11.7471
hfenergy: -856.807435 hartree
pointgroup: C01 [X(C11H13N1O5)]
dipole: -0.3770074 -0.4069591 0.2847056 debye
polarizability: 185.0999865|15.6028922|123.5152994|16.2949162|-5.8747031|113.44689 unknown
InChI: InChI=1S/C11H13NO5/c13-6-9(10(14)15)12-11(16)17-7-8-4-2-1-3-5-8/h1-5,9,12-14H,6-7H2
charge 0 multiplicity 1
30 atoms
O  0.490012 -0.160345 -0.250328
O  -3.733275 -1.005675 1.826837
O  -5.297605 1.018312 -0.288826
O  -3.493606 2.171187 0.617355
O  -0.986997 -1.513005 -1.506078
N  -1.754334 0.157074 -0.053012
C  -3.164763 -0.093322 -0.329628
C  -3.727686 -1.336773 0.397459
C  2.909111 -0.325199 -0.318422
C  1.633372 -0.900963 -0.881432
C  -3.956217 1.153533 0.063907
C  -0.780278 -0.5850 -0.673692
C  3.519064 0.801573 -0.925384
C  3.514591 -0.900653 0.826668
C  4.709257 1.347011 -0.39551
C  4.705551 -0.358809 1.359462
C  5.30532 0.767148 0.748909
H  -3.30082 -0.271258 -1.413839
H  -3.069144 -2.196819 0.167738
H  -4.752274 -1.535269 0.025194
H  -1.505875 0.88629 0.619345
H  1.559292 -0.772482 -1.976031
H  1.516665 -1.974335 -0.648832
H  3.056632 1.253431 -1.811245
H  3.048949 -1.771884 1.303165
H  5.171707 2.218101 -0.872775
H  5.164953 -0.812221 2.244792
H  6.230178 1.187739 1.159592
H  -3.950718 -1.808044 2.361039
H  -5.802262 1.822954 0.007072
